Wireshark-dev: [Wireshark-dev] Hmmm, don't understand why this failed
From: Richard Sharpe <[email protected]>
Date: Wed, 6 Mar 2019 19:12:09 -0800
Hi folks,

I got this error with my latest petri-dish build:

31: ======================================================================
31: FAIL: test_unit_fieldcount (suite_unittests.case_unittests)
31: fieldcount
31: ----------------------------------------------------------------------
31: Traceback (most recent call last):
31:   File "/home/wireshark/builders/ubuntu-x86-64-petri-dish/ubuntu-x86-64-petri-dish/build/test/fixtures.py",
line 47, in wrapped
31:     test_fn(self, *fixtures)
31:   File "/home/wireshark/builders/ubuntu-x86-64-petri-dish/ubuntu-x86-64-petri-dish/build/test/suite_unittests.py",
line 53, in test_unit_fieldcount
31:     self.assertRun((cmd_tshark, '-G', 'fieldcount'), env=test_env)
31:   File "/home/wireshark/builders/ubuntu-x86-64-petri-dish/ubuntu-x86-64-petri-dish/build/test/subprocesstest.py",
line 289, in assertRun
31:     self.assertEqual(process.returncode, expected_return)
31: AssertionError: 1 != 0
31:
31: ----------------------------------------------------------------------
31: Ran 8 tests in 7.366s
31:
31: FAILED (failures=1)

Not sure what the error is. Can anyone help?

Here is a link to the build:
http://buildbot.wireshark.org/petri-dish/builders/Ubuntu%20Petri%20Dish%20x64/builds/7358

-- 
Regards,
Richard Sharpe
(何以解憂?唯有杜康。--曹操)(传说杜康是酒的发明者)