Wireshark-dev: [Wireshark-dev] error building wireshark-2.6.2 on RHEL 7.3
From: "Shahar Keren (shkeren)" <[email protected]>
Date: Mon, 30 Jul 2018 12:43:38 +0000

Hi

I am trying to install latest stable release on my RH.

according to err log - 

/bin/c++    -fexcess-precision=fast  -DCXX__Wcomma_VALID -fPIE   -fexcess-precision=fast -Wcomma -o CMakeFiles/cmTryCompileExec4287660239.dir/src.cxx.o -c /tmp/build/CMakeFiles/CMakeTmp/src.cxx
c++: error: unrecognized command line option '-Wcomma'
gmake[1]: *** [CMakeFiles/cmTryCompileExec4287660239.dir/src.cxx.o] Error 1
gmake[1]: Leaving directory `/tmp/build/CMakeFiles/CMakeTmp'
gmake: *** [cmTryCompileExec4287660239/fast] Error 2

I do not see specific c++ requirements in dev guide lib reference.
stdout and stderr logs attached.

any advise ?

thanks,
Shahar​


Performing C SOURCE FILE Test C__Wheader_guard_VALID failed with the following output:
Change Dir: /tmp/build/CMakeFiles/CMakeTmp

Run Build Command:/bin/gmake "cmTryCompileExec2961711394/fast"
/bin/gmake -f CMakeFiles/cmTryCompileExec2961711394.dir/build.make CMakeFiles/cmTryCompileExec2961711394.dir/build
gmake[1]: Entering directory `/tmp/build/CMakeFiles/CMakeTmp'
/usr/bin/cmake -E cmake_progress_report /tmp/build/CMakeFiles/CMakeTmp/CMakeFiles 1
Building C object CMakeFiles/cmTryCompileExec2961711394.dir/src.c.o
/bin/cc   -fexcess-precision=fast -std=gnu99  -DC__Wheader_guard_VALID -fPIE   -fexcess-precision=fast -Wheader-guard -o CMakeFiles/cmTryCompileExec2961711394.dir/src.c.o   -c /tmp/build/CMakeFiles/CMakeTmp/src.c
cc: error: unrecognized command line option '-Wheader-guard'
gmake[1]: *** [CMakeFiles/cmTryCompileExec2961711394.dir/src.c.o] Error 1
gmake[1]: Leaving directory `/tmp/build/CMakeFiles/CMakeTmp'
gmake: *** [cmTryCompileExec2961711394/fast] Error 2

Source file was:
int main(void) { return 0; }
Performing C SOURCE FILE Test C__Wunused_const_variable_VALID failed with the following output:
Change Dir: /tmp/build/CMakeFiles/CMakeTmp

Run Build Command:/bin/gmake "cmTryCompileExec2078930040/fast"
/bin/gmake -f CMakeFiles/cmTryCompileExec2078930040.dir/build.make CMakeFiles/cmTryCompileExec2078930040.dir/build
gmake[1]: Entering directory `/tmp/build/CMakeFiles/CMakeTmp'
/usr/bin/cmake -E cmake_progress_report /tmp/build/CMakeFiles/CMakeTmp/CMakeFiles 1
Building C object CMakeFiles/cmTryCompileExec2078930040.dir/src.c.o
/bin/cc   -fexcess-precision=fast -std=gnu99  -DC__Wunused_const_variable_VALID -fPIE   -fexcess-precision=fast -Wunused-const-variable -o CMakeFiles/cmTryCompileExec2078930040.dir/src.c.o   -c /tmp/build/CMakeFiles/CMakeTmp/src.c
cc: error: unrecognized command line option '-Wunused-const-variable'
gmake[1]: *** [CMakeFiles/cmTryCompileExec2078930040.dir/src.c.o] Error 1
gmake[1]: Leaving directory `/tmp/build/CMakeFiles/CMakeTmp'
gmake: *** [cmTryCompileExec2078930040/fast] Error 2

Source file was:
int main(void) { return 0; }
Performing C SOURCE FILE Test C__Wshorten_64_to_32_VALID failed with the following output:
Change Dir: /tmp/build/CMakeFiles/CMakeTmp

Run Build Command:/bin/gmake "cmTryCompileExec782510658/fast"
/bin/gmake -f CMakeFiles/cmTryCompileExec782510658.dir/build.make CMakeFiles/cmTryCompileExec782510658.dir/build
gmake[1]: Entering directory `/tmp/build/CMakeFiles/CMakeTmp'
/usr/bin/cmake -E cmake_progress_report /tmp/build/CMakeFiles/CMakeTmp/CMakeFiles 1
Building C object CMakeFiles/cmTryCompileExec782510658.dir/src.c.o
/bin/cc   -fexcess-precision=fast -std=gnu99  -DC__Wshorten_64_to_32_VALID -fPIE   -fexcess-precision=fast -Wshorten-64-to-32 -o CMakeFiles/cmTryCompileExec782510658.dir/src.c.o   -c /tmp/build/CMakeFiles/CMakeTmp/src.c
cc: error: unrecognized command line option '-Wshorten-64-to-32'
gmake[1]: *** [CMakeFiles/cmTryCompileExec782510658.dir/src.c.o] Error 1
gmake[1]: Leaving directory `/tmp/build/CMakeFiles/CMakeTmp'
gmake: *** [cmTryCompileExec782510658/fast] Error 2

Source file was:
int main(void) { return 0; }
Performing C SOURCE FILE Test C__Wcomma_VALID failed with the following output:
Change Dir: /tmp/build/CMakeFiles/CMakeTmp

Run Build Command:/bin/gmake "cmTryCompileExec2781274166/fast"
/bin/gmake -f CMakeFiles/cmTryCompileExec2781274166.dir/build.make CMakeFiles/cmTryCompileExec2781274166.dir/build
gmake[1]: Entering directory `/tmp/build/CMakeFiles/CMakeTmp'
/usr/bin/cmake -E cmake_progress_report /tmp/build/CMakeFiles/CMakeTmp/CMakeFiles 1
Building C object CMakeFiles/cmTryCompileExec2781274166.dir/src.c.o
/bin/cc   -fexcess-precision=fast -std=gnu99  -DC__Wcomma_VALID -fPIE   -fexcess-precision=fast -Wcomma -o CMakeFiles/cmTryCompileExec2781274166.dir/src.c.o   -c /tmp/build/CMakeFiles/CMakeTmp/src.c
cc: error: unrecognized command line option '-Wcomma'
gmake[1]: *** [CMakeFiles/cmTryCompileExec2781274166.dir/src.c.o] Error 1
gmake[1]: Leaving directory `/tmp/build/CMakeFiles/CMakeTmp'
gmake: *** [cmTryCompileExec2781274166/fast] Error 2

Source file was:
int main(void) { return 0; }
Performing C++ SOURCE FILE Test CXX__Wheader_guard_VALID failed with the following output:
Change Dir: /tmp/build/CMakeFiles/CMakeTmp

Run Build Command:/bin/gmake "cmTryCompileExec3888216755/fast"
/bin/gmake -f CMakeFiles/cmTryCompileExec3888216755.dir/build.make CMakeFiles/cmTryCompileExec3888216755.dir/build
gmake[1]: Entering directory `/tmp/build/CMakeFiles/CMakeTmp'
/usr/bin/cmake -E cmake_progress_report /tmp/build/CMakeFiles/CMakeTmp/CMakeFiles 1
Building CXX object CMakeFiles/cmTryCompileExec3888216755.dir/src.cxx.o
/bin/c++    -fexcess-precision=fast  -DCXX__Wheader_guard_VALID -fPIE   -fexcess-precision=fast -Wheader-guard -o CMakeFiles/cmTryCompileExec3888216755.dir/src.cxx.o -c /tmp/build/CMakeFiles/CMakeTmp/src.cxx
c++: error: unrecognized command line option '-Wheader-guard'
gmake[1]: *** [CMakeFiles/cmTryCompileExec3888216755.dir/src.cxx.o] Error 1
gmake[1]: Leaving directory `/tmp/build/CMakeFiles/CMakeTmp'
gmake: *** [cmTryCompileExec3888216755/fast] Error 2

Source file was:
int main(void) { return 0; }
Performing C++ SOURCE FILE Test CXX__Wcomma_VALID failed with the following output:
Change Dir: /tmp/build/CMakeFiles/CMakeTmp

Run Build Command:/bin/gmake "cmTryCompileExec4287660239/fast"
/bin/gmake -f CMakeFiles/cmTryCompileExec4287660239.dir/build.make CMakeFiles/cmTryCompileExec4287660239.dir/build
gmake[1]: Entering directory `/tmp/build/CMakeFiles/CMakeTmp'
/usr/bin/cmake -E cmake_progress_report /tmp/build/CMakeFiles/CMakeTmp/CMakeFiles 1
Building CXX object CMakeFiles/cmTryCompileExec4287660239.dir/src.cxx.o
/bin/c++    -fexcess-precision=fast  -DCXX__Wcomma_VALID -fPIE   -fexcess-precision=fast -Wcomma -o CMakeFiles/cmTryCompileExec4287660239.dir/src.cxx.o -c /tmp/build/CMakeFiles/CMakeTmp/src.cxx
c++: error: unrecognized command line option '-Wcomma'
gmake[1]: *** [CMakeFiles/cmTryCompileExec4287660239.dir/src.cxx.o] Error 1
gmake[1]: Leaving directory `/tmp/build/CMakeFiles/CMakeTmp'
gmake: *** [cmTryCompileExec4287660239/fast] Error 2

Source file was:
int main(void) { return 0; }
The system is: Linux - 3.10.0-514.26.2.el7.x86_64 - x86_64
Compiling the C compiler identification source file "CMakeCCompilerId.c" succeeded.
Compiler: /bin/cc 
Build flags: 
Id flags: 

The output was:
0


Compilation of the C compiler identification source "CMakeCCompilerId.c" produced "a.out"

The C compiler identification is GNU, found in "/tmp/build/CMakeFiles/2.8.12.2/CompilerIdC/a.out"

Compiling the CXX compiler identification source file "CMakeCXXCompilerId.cpp" succeeded.
Compiler: /bin/c++ 
Build flags: 
Id flags: 

The output was:
0


Compilation of the CXX compiler identification source "CMakeCXXCompilerId.cpp" produced "a.out"

The CXX compiler identification is GNU, found in "/tmp/build/CMakeFiles/2.8.12.2/CompilerIdCXX/a.out"

Determining if the C compiler works passed with the following output:
Change Dir: /tmp/build/CMakeFiles/CMakeTmp

Run Build Command:/bin/gmake "cmTryCompileExec3479836240/fast"
/bin/gmake -f CMakeFiles/cmTryCompileExec3479836240.dir/build.make CMakeFiles/cmTryCompileExec3479836240.dir/build
gmake[1]: Entering directory `/tmp/build/CMakeFiles/CMakeTmp'
/usr/bin/cmake -E cmake_progress_report /tmp/build/CMakeFiles/CMakeTmp/CMakeFiles 1
Building C object CMakeFiles/cmTryCompileExec3479836240.dir/testCCompiler.c.o
/bin/cc    -o CMakeFiles/cmTryCompileExec3479836240.dir/testCCompiler.c.o   -c /tmp/build/CMakeFiles/CMakeTmp/testCCompiler.c
Linking C executable cmTryCompileExec3479836240
/usr/bin/cmake -E cmake_link_script CMakeFiles/cmTryCompileExec3479836240.dir/link.txt --verbose=1
/bin/cc       CMakeFiles/cmTryCompileExec3479836240.dir/testCCompiler.c.o  -o cmTryCompileExec3479836240 -rdynamic 
gmake[1]: Leaving directory `/tmp/build/CMakeFiles/CMakeTmp'


Detecting C compiler ABI info compiled with the following output:
Change Dir: /tmp/build/CMakeFiles/CMakeTmp

Run Build Command:/bin/gmake "cmTryCompileExec3525228245/fast"
/bin/gmake -f CMakeFiles/cmTryCompileExec3525228245.dir/build.make CMakeFiles/cmTryCompileExec3525228245.dir/build
gmake[1]: Entering directory `/tmp/build/CMakeFiles/CMakeTmp'
/usr/bin/cmake -E cmake_progress_report /tmp/build/CMakeFiles/CMakeTmp/CMakeFiles 1
Building C object CMakeFiles/cmTryCompileExec3525228245.dir/CMakeCCompilerABI.c.o
/bin/cc    -o CMakeFiles/cmTryCompileExec3525228245.dir/CMakeCCompilerABI.c.o   -c /usr/share/cmake/Modules/CMakeCCompilerABI.c
Linking C executable cmTryCompileExec3525228245
/usr/bin/cmake -E cmake_link_script CMakeFiles/cmTryCompileExec3525228245.dir/link.txt --verbose=1
/bin/cc     -v CMakeFiles/cmTryCompileExec3525228245.dir/CMakeCCompilerABI.c.o  -o cmTryCompileExec3525228245 -rdynamic  
Using built-in specs.
COLLECT_GCC=/bin/cc
COLLECT_LTO_WRAPPER=/usr/libexec/gcc/x86_64-redhat-linux/4.8.5/lto-wrapper
Target: x86_64-redhat-linux
Configured with: ../configure --prefix=/usr --mandir=/usr/share/man --infodir=/usr/share/info --with-bugurl=http://bugzilla.redhat.com/bugzilla --enable-bootstrap --enable-shared --enable-threads=posix --enable-checking=release --with-system-zlib --enable-__cxa_atexit --disable-libunwind-exceptions --enable-gnu-unique-object --enable-linker-build-id --with-linker-hash-style=gnu --enable-languages=c,c++,objc,obj-c++,java,fortran,ada,go,lto --enable-plugin --enable-initfini-array --disable-libgcj --with-isl=/builddir/build/BUILD/gcc-4.8.5-20150702/obj-x86_64-redhat-linux/isl-install --with-cloog=/builddir/build/BUILD/gcc-4.8.5-20150702/obj-x86_64-redhat-linux/cloog-install --enable-gnu-indirect-function --with-tune=generic --with-arch_32=x86-64 --build=x86_64-redhat-linux
Thread model: posix
gcc version 4.8.5 20150623 (Red Hat 4.8.5-11) (GCC) 
COMPILER_PATH=/usr/libexec/gcc/x86_64-redhat-linux/4.8.5/:/usr/libexec/gcc/x86_64-redhat-linux/4.8.5/:/usr/libexec/gcc/x86_64-redhat-linux/:/usr/lib/gcc/x86_64-redhat-linux/4.8.5/:/usr/lib/gcc/x86_64-redhat-linux/
LIBRARY_PATH=/usr/lib/gcc/x86_64-redhat-linux/4.8.5/:/usr/lib/gcc/x86_64-redhat-linux/4.8.5/../../../../lib64/:/lib/../lib64/:/usr/lib/../lib64/:/usr/lib/gcc/x86_64-redhat-linux/4.8.5/../../../:/lib/:/usr/lib/
COLLECT_GCC_OPTIONS='-v' '-o' 'cmTryCompileExec3525228245' '-rdynamic' '-mtune=generic' '-march=x86-64'
 /usr/libexec/gcc/x86_64-redhat-linux/4.8.5/collect2 --build-id --no-add-needed --eh-frame-hdr --hash-style=gnu -m elf_x86_64 -export-dynamic -dynamic-linker /lib64/ld-linux-x86-64.so.2 -o cmTryCompileExec3525228245 /usr/lib/gcc/x86_64-redhat-linux/4.8.5/../../../../lib64/crt1.o /usr/lib/gcc/x86_64-redhat-linux/4.8.5/../../../../lib64/crti.o /usr/lib/gcc/x86_64-redhat-linux/4.8.5/crtbegin.o -L/usr/lib/gcc/x86_64-redhat-linux/4.8.5 -L/usr/lib/gcc/x86_64-redhat-linux/4.8.5/../../../../lib64 -L/lib/../lib64 -L/usr/lib/../lib64 -L/usr/lib/gcc/x86_64-redhat-linux/4.8.5/../../.. CMakeFiles/cmTryCompileExec3525228245.dir/CMakeCCompilerABI.c.o -lgcc --as-needed -lgcc_s --no-as-needed -lc -lgcc --as-needed -lgcc_s --no-as-needed /usr/lib/gcc/x86_64-redhat-linux/4.8.5/crtend.o /usr/lib/gcc/x86_64-redhat-linux/4.8.5/../../../../lib64/crtn.o
gmake[1]: Leaving directory `/tmp/build/CMakeFiles/CMakeTmp'


Parsed C implicit link information from above output:
  link line regex: [^( *|.*[/\])(ld|([^/\]+-)?ld|collect2)[^/\]*( |$)]
  ignore line: [Change Dir: /tmp/build/CMakeFiles/CMakeTmp]
  ignore line: []
  ignore line: [Run Build Command:/bin/gmake "cmTryCompileExec3525228245/fast"]
  ignore line: [/bin/gmake -f CMakeFiles/cmTryCompileExec3525228245.dir/build.make CMakeFiles/cmTryCompileExec3525228245.dir/build]
  ignore line: [gmake[1]: Entering directory `/tmp/build/CMakeFiles/CMakeTmp']
  ignore line: [/usr/bin/cmake -E cmake_progress_report /tmp/build/CMakeFiles/CMakeTmp/CMakeFiles 1]
  ignore line: [Building C object CMakeFiles/cmTryCompileExec3525228245.dir/CMakeCCompilerABI.c.o]
  ignore line: [/bin/cc    -o CMakeFiles/cmTryCompileExec3525228245.dir/CMakeCCompilerABI.c.o   -c /usr/share/cmake/Modules/CMakeCCompilerABI.c]
  ignore line: [Linking C executable cmTryCompileExec3525228245]
  ignore line: [/usr/bin/cmake -E cmake_link_script CMakeFiles/cmTryCompileExec3525228245.dir/link.txt --verbose=1]
  ignore line: [/bin/cc     -v CMakeFiles/cmTryCompileExec3525228245.dir/CMakeCCompilerABI.c.o  -o cmTryCompileExec3525228245 -rdynamic  ]
  ignore line: [Using built-in specs.]
  ignore line: [COLLECT_GCC=/bin/cc]
  ignore line: [COLLECT_LTO_WRAPPER=/usr/libexec/gcc/x86_64-redhat-linux/4.8.5/lto-wrapper]
  ignore line: [Target: x86_64-redhat-linux]
  ignore line: [Configured with: ../configure --prefix=/usr --mandir=/usr/share/man --infodir=/usr/share/info --with-bugurl=http://bugzilla.redhat.com/bugzilla --enable-bootstrap --enable-shared --enable-threads=posix --enable-checking=release --with-system-zlib --enable-__cxa_atexit --disable-libunwind-exceptions --enable-gnu-unique-object --enable-linker-build-id --with-linker-hash-style=gnu --enable-languages=c,c++,objc,obj-c++,java,fortran,ada,go,lto --enable-plugin --enable-initfini-array --disable-libgcj --with-isl=/builddir/build/BUILD/gcc-4.8.5-20150702/obj-x86_64-redhat-linux/isl-install --with-cloog=/builddir/build/BUILD/gcc-4.8.5-20150702/obj-x86_64-redhat-linux/cloog-install --enable-gnu-indirect-function --with-tune=generic --with-arch_32=x86-64 --build=x86_64-redhat-linux]
  ignore line: [Thread model: posix]
  ignore line: [gcc version 4.8.5 20150623 (Red Hat 4.8.5-11) (GCC) ]
  ignore line: [COMPILER_PATH=/usr/libexec/gcc/x86_64-redhat-linux/4.8.5/:/usr/libexec/gcc/x86_64-redhat-linux/4.8.5/:/usr/libexec/gcc/x86_64-redhat-linux/:/usr/lib/gcc/x86_64-redhat-linux/4.8.5/:/usr/lib/gcc/x86_64-redhat-linux/]
  ignore line: [LIBRARY_PATH=/usr/lib/gcc/x86_64-redhat-linux/4.8.5/:/usr/lib/gcc/x86_64-redhat-linux/4.8.5/../../../../lib64/:/lib/../lib64/:/usr/lib/../lib64/:/usr/lib/gcc/x86_64-redhat-linux/4.8.5/../../../:/lib/:/usr/lib/]
  ignore line: [COLLECT_GCC_OPTIONS='-v' '-o' 'cmTryCompileExec3525228245' '-rdynamic' '-mtune=generic' '-march=x86-64']
  link line: [ /usr/libexec/gcc/x86_64-redhat-linux/4.8.5/collect2 --build-id --no-add-needed --eh-frame-hdr --hash-style=gnu -m elf_x86_64 -export-dynamic -dynamic-linker /lib64/ld-linux-x86-64.so.2 -o cmTryCompileExec3525228245 /usr/lib/gcc/x86_64-redhat-linux/4.8.5/../../../../lib64/crt1.o /usr/lib/gcc/x86_64-redhat-linux/4.8.5/../../../../lib64/crti.o /usr/lib/gcc/x86_64-redhat-linux/4.8.5/crtbegin.o -L/usr/lib/gcc/x86_64-redhat-linux/4.8.5 -L/usr/lib/gcc/x86_64-redhat-linux/4.8.5/../../../../lib64 -L/lib/../lib64 -L/usr/lib/../lib64 -L/usr/lib/gcc/x86_64-redhat-linux/4.8.5/../../.. CMakeFiles/cmTryCompileExec3525228245.dir/CMakeCCompilerABI.c.o -lgcc --as-needed -lgcc_s --no-as-needed -lc -lgcc --as-needed -lgcc_s --no-as-needed /usr/lib/gcc/x86_64-redhat-linux/4.8.5/crtend.o /usr/lib/gcc/x86_64-redhat-linux/4.8.5/../../../../lib64/crtn.o]
    arg [/usr/libexec/gcc/x86_64-redhat-linux/4.8.5/collect2] ==> ignore
    arg [--build-id] ==> ignore
    arg [--no-add-needed] ==> ignore
    arg [--eh-frame-hdr] ==> ignore
    arg [--hash-style=gnu] ==> ignore
    arg [-m] ==> ignore
    arg [elf_x86_64] ==> ignore
    arg [-export-dynamic] ==> ignore
    arg [-dynamic-linker] ==> ignore
    arg [/lib64/ld-linux-x86-64.so.2] ==> ignore
    arg [-o] ==> ignore
    arg [cmTryCompileExec3525228245] ==> ignore
    arg [/usr/lib/gcc/x86_64-redhat-linux/4.8.5/../../../../lib64/crt1.o] ==> ignore
    arg [/usr/lib/gcc/x86_64-redhat-linux/4.8.5/../../../../lib64/crti.o] ==> ignore
    arg [/usr/lib/gcc/x86_64-redhat-linux/4.8.5/crtbegin.o] ==> ignore
    arg [-L/usr/lib/gcc/x86_64-redhat-linux/4.8.5] ==> dir [/usr/lib/gcc/x86_64-redhat-linux/4.8.5]
    arg [-L/usr/lib/gcc/x86_64-redhat-linux/4.8.5/../../../../lib64] ==> dir [/usr/lib/gcc/x86_64-redhat-linux/4.8.5/../../../../lib64]
    arg [-L/lib/../lib64] ==> dir [/lib/../lib64]
    arg [-L/usr/lib/../lib64] ==> dir [/usr/lib/../lib64]
    arg [-L/usr/lib/gcc/x86_64-redhat-linux/4.8.5/../../..] ==> dir [/usr/lib/gcc/x86_64-redhat-linux/4.8.5/../../..]
    arg [CMakeFiles/cmTryCompileExec3525228245.dir/CMakeCCompilerABI.c.o] ==> ignore
    arg [-lgcc] ==> lib [gcc]
    arg [--as-needed] ==> ignore
    arg [-lgcc_s] ==> lib [gcc_s]
    arg [--no-as-needed] ==> ignore
    arg [-lc] ==> lib [c]
    arg [-lgcc] ==> lib [gcc]
    arg [--as-needed] ==> ignore
    arg [-lgcc_s] ==> lib [gcc_s]
    arg [--no-as-needed] ==> ignore
    arg [/usr/lib/gcc/x86_64-redhat-linux/4.8.5/crtend.o] ==> ignore
    arg [/usr/lib/gcc/x86_64-redhat-linux/4.8.5/../../../../lib64/crtn.o] ==> ignore
  remove lib [gcc]
  remove lib [gcc_s]
  remove lib [gcc]
  remove lib [gcc_s]
  collapse library dir [/usr/lib/gcc/x86_64-redhat-linux/4.8.5] ==> [/usr/lib/gcc/x86_64-redhat-linux/4.8.5]
  collapse library dir [/usr/lib/gcc/x86_64-redhat-linux/4.8.5/../../../../lib64] ==> [/usr/lib64]
  collapse library dir [/lib/../lib64] ==> [/lib64]
  collapse library dir [/usr/lib/../lib64] ==> [/usr/lib64]
  collapse library dir [/usr/lib/gcc/x86_64-redhat-linux/4.8.5/../../..] ==> [/usr/lib]
  implicit libs: [c]
  implicit dirs: [/usr/lib/gcc/x86_64-redhat-linux/4.8.5;/usr/lib64;/lib64;/usr/lib]
  implicit fwks: []


Determining if the CXX compiler works passed with the following output:
Change Dir: /tmp/build/CMakeFiles/CMakeTmp

Run Build Command:/bin/gmake "cmTryCompileExec3873765022/fast"
/bin/gmake -f CMakeFiles/cmTryCompileExec3873765022.dir/build.make CMakeFiles/cmTryCompileExec3873765022.dir/build
gmake[1]: Entering directory `/tmp/build/CMakeFiles/CMakeTmp'
/usr/bin/cmake -E cmake_progress_report /tmp/build/CMakeFiles/CMakeTmp/CMakeFiles 1
Building CXX object CMakeFiles/cmTryCompileExec3873765022.dir/testCXXCompiler.cxx.o
/bin/c++     -o CMakeFiles/cmTryCompileExec3873765022.dir/testCXXCompiler.cxx.o -c /tmp/build/CMakeFiles/CMakeTmp/testCXXCompiler.cxx
Linking CXX executable cmTryCompileExec3873765022
/usr/bin/cmake -E cmake_link_script CMakeFiles/cmTryCompileExec3873765022.dir/link.txt --verbose=1
/bin/c++        CMakeFiles/cmTryCompileExec3873765022.dir/testCXXCompiler.cxx.o  -o cmTryCompileExec3873765022 -rdynamic 
gmake[1]: Leaving directory `/tmp/build/CMakeFiles/CMakeTmp'


Detecting CXX compiler ABI info compiled with the following output:
Change Dir: /tmp/build/CMakeFiles/CMakeTmp

Run Build Command:/bin/gmake "cmTryCompileExec777040574/fast"
/bin/gmake -f CMakeFiles/cmTryCompileExec777040574.dir/build.make CMakeFiles/cmTryCompileExec777040574.dir/build
gmake[1]: Entering directory `/tmp/build/CMakeFiles/CMakeTmp'
/usr/bin/cmake -E cmake_progress_report /tmp/build/CMakeFiles/CMakeTmp/CMakeFiles 1
Building CXX object CMakeFiles/cmTryCompileExec777040574.dir/CMakeCXXCompilerABI.cpp.o
/bin/c++     -o CMakeFiles/cmTryCompileExec777040574.dir/CMakeCXXCompilerABI.cpp.o -c /usr/share/cmake/Modules/CMakeCXXCompilerABI.cpp
Linking CXX executable cmTryCompileExec777040574
/usr/bin/cmake -E cmake_link_script CMakeFiles/cmTryCompileExec777040574.dir/link.txt --verbose=1
/bin/c++      -v CMakeFiles/cmTryCompileExec777040574.dir/CMakeCXXCompilerABI.cpp.o  -o cmTryCompileExec777040574 -rdynamic  
Using built-in specs.
COLLECT_GCC=/bin/c++
COLLECT_LTO_WRAPPER=/usr/libexec/gcc/x86_64-redhat-linux/4.8.5/lto-wrapper
Target: x86_64-redhat-linux
Configured with: ../configure --prefix=/usr --mandir=/usr/share/man --infodir=/usr/share/info --with-bugurl=http://bugzilla.redhat.com/bugzilla --enable-bootstrap --enable-shared --enable-threads=posix --enable-checking=release --with-system-zlib --enable-__cxa_atexit --disable-libunwind-exceptions --enable-gnu-unique-object --enable-linker-build-id --with-linker-hash-style=gnu --enable-languages=c,c++,objc,obj-c++,java,fortran,ada,go,lto --enable-plugin --enable-initfini-array --disable-libgcj --with-isl=/builddir/build/BUILD/gcc-4.8.5-20150702/obj-x86_64-redhat-linux/isl-install --with-cloog=/builddir/build/BUILD/gcc-4.8.5-20150702/obj-x86_64-redhat-linux/cloog-install --enable-gnu-indirect-function --with-tune=generic --with-arch_32=x86-64 --build=x86_64-redhat-linux
Thread model: posix
gcc version 4.8.5 20150623 (Red Hat 4.8.5-11) (GCC) 
COMPILER_PATH=/usr/libexec/gcc/x86_64-redhat-linux/4.8.5/:/usr/libexec/gcc/x86_64-redhat-linux/4.8.5/:/usr/libexec/gcc/x86_64-redhat-linux/:/usr/lib/gcc/x86_64-redhat-linux/4.8.5/:/usr/lib/gcc/x86_64-redhat-linux/
LIBRARY_PATH=/usr/lib/gcc/x86_64-redhat-linux/4.8.5/:/usr/lib/gcc/x86_64-redhat-linux/4.8.5/../../../../lib64/:/lib/../lib64/:/usr/lib/../lib64/:/usr/lib/gcc/x86_64-redhat-linux/4.8.5/../../../:/lib/:/usr/lib/
COLLECT_GCC_OPTIONS='-v' '-o' 'cmTryCompileExec777040574' '-rdynamic' '-shared-libgcc' '-mtune=generic' '-march=x86-64'
 /usr/libexec/gcc/x86_64-redhat-linux/4.8.5/collect2 --build-id --no-add-needed --eh-frame-hdr --hash-style=gnu -m elf_x86_64 -export-dynamic -dynamic-linker /lib64/ld-linux-x86-64.so.2 -o cmTryCompileExec777040574 /usr/lib/gcc/x86_64-redhat-linux/4.8.5/../../../../lib64/crt1.o /usr/lib/gcc/x86_64-redhat-linux/4.8.5/../../../../lib64/crti.o /usr/lib/gcc/x86_64-redhat-linux/4.8.5/crtbegin.o -L/usr/lib/gcc/x86_64-redhat-linux/4.8.5 -L/usr/lib/gcc/x86_64-redhat-linux/4.8.5/../../../../lib64 -L/lib/../lib64 -L/usr/lib/../lib64 -L/usr/lib/gcc/x86_64-redhat-linux/4.8.5/../../.. CMakeFiles/cmTryCompileExec777040574.dir/CMakeCXXCompilerABI.cpp.o -lstdc++ -lm -lgcc_s -lgcc -lc -lgcc_s -lgcc /usr/lib/gcc/x86_64-redhat-linux/4.8.5/crtend.o /usr/lib/gcc/x86_64-redhat-linux/4.8.5/../../../../lib64/crtn.o
gmake[1]: Leaving directory `/tmp/build/CMakeFiles/CMakeTmp'


Parsed CXX implicit link information from above output:
  link line regex: [^( *|.*[/\])(ld|([^/\]+-)?ld|collect2)[^/\]*( |$)]
  ignore line: [Change Dir: /tmp/build/CMakeFiles/CMakeTmp]
  ignore line: []
  ignore line: [Run Build Command:/bin/gmake "cmTryCompileExec777040574/fast"]
  ignore line: [/bin/gmake -f CMakeFiles/cmTryCompileExec777040574.dir/build.make CMakeFiles/cmTryCompileExec777040574.dir/build]
  ignore line: [gmake[1]: Entering directory `/tmp/build/CMakeFiles/CMakeTmp']
  ignore line: [/usr/bin/cmake -E cmake_progress_report /tmp/build/CMakeFiles/CMakeTmp/CMakeFiles 1]
  ignore line: [Building CXX object CMakeFiles/cmTryCompileExec777040574.dir/CMakeCXXCompilerABI.cpp.o]
  ignore line: [/bin/c++     -o CMakeFiles/cmTryCompileExec777040574.dir/CMakeCXXCompilerABI.cpp.o -c /usr/share/cmake/Modules/CMakeCXXCompilerABI.cpp]
  ignore line: [Linking CXX executable cmTryCompileExec777040574]
  ignore line: [/usr/bin/cmake -E cmake_link_script CMakeFiles/cmTryCompileExec777040574.dir/link.txt --verbose=1]
  ignore line: [/bin/c++      -v CMakeFiles/cmTryCompileExec777040574.dir/CMakeCXXCompilerABI.cpp.o  -o cmTryCompileExec777040574 -rdynamic  ]
  ignore line: [Using built-in specs.]
  ignore line: [COLLECT_GCC=/bin/c++]
  ignore line: [COLLECT_LTO_WRAPPER=/usr/libexec/gcc/x86_64-redhat-linux/4.8.5/lto-wrapper]
  ignore line: [Target: x86_64-redhat-linux]
  ignore line: [Configured with: ../configure --prefix=/usr --mandir=/usr/share/man --infodir=/usr/share/info --with-bugurl=http://bugzilla.redhat.com/bugzilla --enable-bootstrap --enable-shared --enable-threads=posix --enable-checking=release --with-system-zlib --enable-__cxa_atexit --disable-libunwind-exceptions --enable-gnu-unique-object --enable-linker-build-id --with-linker-hash-style=gnu --enable-languages=c,c++,objc,obj-c++,java,fortran,ada,go,lto --enable-plugin --enable-initfini-array --disable-libgcj --with-isl=/builddir/build/BUILD/gcc-4.8.5-20150702/obj-x86_64-redhat-linux/isl-install --with-cloog=/builddir/build/BUILD/gcc-4.8.5-20150702/obj-x86_64-redhat-linux/cloog-install --enable-gnu-indirect-function --with-tune=generic --with-arch_32=x86-64 --build=x86_64-redhat-linux]
  ignore line: [Thread model: posix]
  ignore line: [gcc version 4.8.5 20150623 (Red Hat 4.8.5-11) (GCC) ]
  ignore line: [COMPILER_PATH=/usr/libexec/gcc/x86_64-redhat-linux/4.8.5/:/usr/libexec/gcc/x86_64-redhat-linux/4.8.5/:/usr/libexec/gcc/x86_64-redhat-linux/:/usr/lib/gcc/x86_64-redhat-linux/4.8.5/:/usr/lib/gcc/x86_64-redhat-linux/]
  ignore line: [LIBRARY_PATH=/usr/lib/gcc/x86_64-redhat-linux/4.8.5/:/usr/lib/gcc/x86_64-redhat-linux/4.8.5/../../../../lib64/:/lib/../lib64/:/usr/lib/../lib64/:/usr/lib/gcc/x86_64-redhat-linux/4.8.5/../../../:/lib/:/usr/lib/]
  ignore line: [COLLECT_GCC_OPTIONS='-v' '-o' 'cmTryCompileExec777040574' '-rdynamic' '-shared-libgcc' '-mtune=generic' '-march=x86-64']
  link line: [ /usr/libexec/gcc/x86_64-redhat-linux/4.8.5/collect2 --build-id --no-add-needed --eh-frame-hdr --hash-style=gnu -m elf_x86_64 -export-dynamic -dynamic-linker /lib64/ld-linux-x86-64.so.2 -o cmTryCompileExec777040574 /usr/lib/gcc/x86_64-redhat-linux/4.8.5/../../../../lib64/crt1.o /usr/lib/gcc/x86_64-redhat-linux/4.8.5/../../../../lib64/crti.o /usr/lib/gcc/x86_64-redhat-linux/4.8.5/crtbegin.o -L/usr/lib/gcc/x86_64-redhat-linux/4.8.5 -L/usr/lib/gcc/x86_64-redhat-linux/4.8.5/../../../../lib64 -L/lib/../lib64 -L/usr/lib/../lib64 -L/usr/lib/gcc/x86_64-redhat-linux/4.8.5/../../.. CMakeFiles/cmTryCompileExec777040574.dir/CMakeCXXCompilerABI.cpp.o -lstdc++ -lm -lgcc_s -lgcc -lc -lgcc_s -lgcc /usr/lib/gcc/x86_64-redhat-linux/4.8.5/crtend.o /usr/lib/gcc/x86_64-redhat-linux/4.8.5/../../../../lib64/crtn.o]
    arg [/usr/libexec/gcc/x86_64-redhat-linux/4.8.5/collect2] ==> ignore
    arg [--build-id] ==> ignore
    arg [--no-add-needed] ==> ignore
    arg [--eh-frame-hdr] ==> ignore
    arg [--hash-style=gnu] ==> ignore
    arg [-m] ==> ignore
    arg [elf_x86_64] ==> ignore
    arg [-export-dynamic] ==> ignore
    arg [-dynamic-linker] ==> ignore
    arg [/lib64/ld-linux-x86-64.so.2] ==> ignore
    arg [-o] ==> ignore
    arg [cmTryCompileExec777040574] ==> ignore
    arg [/usr/lib/gcc/x86_64-redhat-linux/4.8.5/../../../../lib64/crt1.o] ==> ignore
    arg [/usr/lib/gcc/x86_64-redhat-linux/4.8.5/../../../../lib64/crti.o] ==> ignore
    arg [/usr/lib/gcc/x86_64-redhat-linux/4.8.5/crtbegin.o] ==> ignore
    arg [-L/usr/lib/gcc/x86_64-redhat-linux/4.8.5] ==> dir [/usr/lib/gcc/x86_64-redhat-linux/4.8.5]
    arg [-L/usr/lib/gcc/x86_64-redhat-linux/4.8.5/../../../../lib64] ==> dir [/usr/lib/gcc/x86_64-redhat-linux/4.8.5/../../../../lib64]
    arg [-L/lib/../lib64] ==> dir [/lib/../lib64]
    arg [-L/usr/lib/../lib64] ==> dir [/usr/lib/../lib64]
    arg [-L/usr/lib/gcc/x86_64-redhat-linux/4.8.5/../../..] ==> dir [/usr/lib/gcc/x86_64-redhat-linux/4.8.5/../../..]
    arg [CMakeFiles/cmTryCompileExec777040574.dir/CMakeCXXCompilerABI.cpp.o] ==> ignore
    arg [-lstdc++] ==> lib [stdc++]
    arg [-lm] ==> lib [m]
    arg [-lgcc_s] ==> lib [gcc_s]
    arg [-lgcc] ==> lib [gcc]
    arg [-lc] ==> lib [c]
    arg [-lgcc_s] ==> lib [gcc_s]
    arg [-lgcc] ==> lib [gcc]
    arg [/usr/lib/gcc/x86_64-redhat-linux/4.8.5/crtend.o] ==> ignore
    arg [/usr/lib/gcc/x86_64-redhat-linux/4.8.5/../../../../lib64/crtn.o] ==> ignore
  remove lib [gcc_s]
  remove lib [gcc]
  remove lib [gcc_s]
  remove lib [gcc]
  collapse library dir [/usr/lib/gcc/x86_64-redhat-linux/4.8.5] ==> [/usr/lib/gcc/x86_64-redhat-linux/4.8.5]
  collapse library dir [/usr/lib/gcc/x86_64-redhat-linux/4.8.5/../../../../lib64] ==> [/usr/lib64]
  collapse library dir [/lib/../lib64] ==> [/lib64]
  collapse library dir [/usr/lib/../lib64] ==> [/usr/lib64]
  collapse library dir [/usr/lib/gcc/x86_64-redhat-linux/4.8.5/../../..] ==> [/usr/lib]
  implicit libs: [stdc++;m;c]
  implicit dirs: [/usr/lib/gcc/x86_64-redhat-linux/4.8.5;/usr/lib64;/lib64;/usr/lib]
  implicit fwks: []


Performing C SOURCE FILE Test C__fexcess_precision_fast_VALID succeded with the following output:
Change Dir: /tmp/build/CMakeFiles/CMakeTmp

Run Build Command:/bin/gmake "cmTryCompileExec647598051/fast"
/bin/gmake -f CMakeFiles/cmTryCompileExec647598051.dir/build.make CMakeFiles/cmTryCompileExec647598051.dir/build
gmake[1]: Entering directory `/tmp/build/CMakeFiles/CMakeTmp'
/usr/bin/cmake -E cmake_progress_report /tmp/build/CMakeFiles/CMakeTmp/CMakeFiles 1
Building C object CMakeFiles/cmTryCompileExec647598051.dir/src.c.o
/bin/cc   -std=gnu99  -DC__fexcess_precision_fast_VALID -fPIE   -fexcess-precision=fast -o CMakeFiles/cmTryCompileExec647598051.dir/src.c.o   -c /tmp/build/CMakeFiles/CMakeTmp/src.c
Linking C executable cmTryCompileExec647598051
/usr/bin/cmake -E cmake_link_script CMakeFiles/cmTryCompileExec647598051.dir/link.txt --verbose=1
/bin/cc  -std=gnu99  -DC__fexcess_precision_fast_VALID    CMakeFiles/cmTryCompileExec647598051.dir/src.c.o  -o cmTryCompileExec647598051 -rdynamic 
gmake[1]: Leaving directory `/tmp/build/CMakeFiles/CMakeTmp'

Source file was:
int main(void) { return 0; }
Performing C++ SOURCE FILE Test CXX__fexcess_precision_fast_VALID succeded with the following output:
Change Dir: /tmp/build/CMakeFiles/CMakeTmp

Run Build Command:/bin/gmake "cmTryCompileExec2943572350/fast"
/bin/gmake -f CMakeFiles/cmTryCompileExec2943572350.dir/build.make CMakeFiles/cmTryCompileExec2943572350.dir/build
gmake[1]: Entering directory `/tmp/build/CMakeFiles/CMakeTmp'
/usr/bin/cmake -E cmake_progress_report /tmp/build/CMakeFiles/CMakeTmp/CMakeFiles 1
Building CXX object CMakeFiles/cmTryCompileExec2943572350.dir/src.cxx.o
/bin/c++    -DCXX__fexcess_precision_fast_VALID -fPIE   -fexcess-precision=fast -o CMakeFiles/cmTryCompileExec2943572350.dir/src.cxx.o -c /tmp/build/CMakeFiles/CMakeTmp/src.cxx
Linking CXX executable cmTryCompileExec2943572350
/usr/bin/cmake -E cmake_link_script CMakeFiles/cmTryCompileExec2943572350.dir/link.txt --verbose=1
/bin/c++    -DCXX__fexcess_precision_fast_VALID    CMakeFiles/cmTryCompileExec2943572350.dir/src.cxx.o  -o cmTryCompileExec2943572350 -rdynamic 
gmake[1]: Leaving directory `/tmp/build/CMakeFiles/CMakeTmp'

Source file was:
int main(void) { return 0; }
Performing C SOURCE FILE Test C__Wall_VALID succeded with the following output:
Change Dir: /tmp/build/CMakeFiles/CMakeTmp

Run Build Command:/bin/gmake "cmTryCompileExec3168877623/fast"
/bin/gmake -f CMakeFiles/cmTryCompileExec3168877623.dir/build.make CMakeFiles/cmTryCompileExec3168877623.dir/build
gmake[1]: Entering directory `/tmp/build/CMakeFiles/CMakeTmp'
/usr/bin/cmake -E cmake_progress_report /tmp/build/CMakeFiles/CMakeTmp/CMakeFiles 1
Building C object CMakeFiles/cmTryCompileExec3168877623.dir/src.c.o
/bin/cc   -fexcess-precision=fast -std=gnu99  -DC__Wall_VALID -fPIE   -fexcess-precision=fast -Wall -o CMakeFiles/cmTryCompileExec3168877623.dir/src.c.o   -c /tmp/build/CMakeFiles/CMakeTmp/src.c
Linking C executable cmTryCompileExec3168877623
/usr/bin/cmake -E cmake_link_script CMakeFiles/cmTryCompileExec3168877623.dir/link.txt --verbose=1
/bin/cc   -fexcess-precision=fast -std=gnu99  -DC__Wall_VALID    CMakeFiles/cmTryCompileExec3168877623.dir/src.c.o  -o cmTryCompileExec3168877623 -rdynamic 
gmake[1]: Leaving directory `/tmp/build/CMakeFiles/CMakeTmp'

Source file was:
int main(void) { return 0; }
Performing C SOURCE FILE Test C__Wextra_VALID succeded with the following output:
Change Dir: /tmp/build/CMakeFiles/CMakeTmp

Run Build Command:/bin/gmake "cmTryCompileExec3293519192/fast"
/bin/gmake -f CMakeFiles/cmTryCompileExec3293519192.dir/build.make CMakeFiles/cmTryCompileExec3293519192.dir/build
gmake[1]: Entering directory `/tmp/build/CMakeFiles/CMakeTmp'
/usr/bin/cmake -E cmake_progress_report /tmp/build/CMakeFiles/CMakeTmp/CMakeFiles 1
Building C object CMakeFiles/cmTryCompileExec3293519192.dir/src.c.o
/bin/cc   -fexcess-precision=fast -std=gnu99  -DC__Wextra_VALID -fPIE   -fexcess-precision=fast -Wextra -o CMakeFiles/cmTryCompileExec3293519192.dir/src.c.o   -c /tmp/build/CMakeFiles/CMakeTmp/src.c
Linking C executable cmTryCompileExec3293519192
/usr/bin/cmake -E cmake_link_script CMakeFiles/cmTryCompileExec3293519192.dir/link.txt --verbose=1
/bin/cc   -fexcess-precision=fast -std=gnu99  -DC__Wextra_VALID    CMakeFiles/cmTryCompileExec3293519192.dir/src.c.o  -o cmTryCompileExec3293519192 -rdynamic 
gmake[1]: Leaving directory `/tmp/build/CMakeFiles/CMakeTmp'

Source file was:
int main(void) { return 0; }
Performing C SOURCE FILE Test C__Wendif_labels_VALID succeded with the following output:
Change Dir: /tmp/build/CMakeFiles/CMakeTmp

Run Build Command:/bin/gmake "cmTryCompileExec2664205708/fast"
/bin/gmake -f CMakeFiles/cmTryCompileExec2664205708.dir/build.make CMakeFiles/cmTryCompileExec2664205708.dir/build
gmake[1]: Entering directory `/tmp/build/CMakeFiles/CMakeTmp'
/usr/bin/cmake -E cmake_progress_report /tmp/build/CMakeFiles/CMakeTmp/CMakeFiles 1
Building C object CMakeFiles/cmTryCompileExec2664205708.dir/src.c.o
/bin/cc   -fexcess-precision=fast -std=gnu99  -DC__Wendif_labels_VALID -fPIE   -fexcess-precision=fast -Wendif-labels -o CMakeFiles/cmTryCompileExec2664205708.dir/src.c.o   -c /tmp/build/CMakeFiles/CMakeTmp/src.c
Linking C executable cmTryCompileExec2664205708
/usr/bin/cmake -E cmake_link_script CMakeFiles/cmTryCompileExec2664205708.dir/link.txt --verbose=1
/bin/cc   -fexcess-precision=fast -std=gnu99  -DC__Wendif_labels_VALID    CMakeFiles/cmTryCompileExec2664205708.dir/src.c.o  -o cmTryCompileExec2664205708 -rdynamic 
gmake[1]: Leaving directory `/tmp/build/CMakeFiles/CMakeTmp'

Source file was:
int main(void) { return 0; }
Performing C SOURCE FILE Test C__Wpointer_arith_VALID succeded with the following output:
Change Dir: /tmp/build/CMakeFiles/CMakeTmp

Run Build Command:/bin/gmake "cmTryCompileExec410970413/fast"
/bin/gmake -f CMakeFiles/cmTryCompileExec410970413.dir/build.make CMakeFiles/cmTryCompileExec410970413.dir/build
gmake[1]: Entering directory `/tmp/build/CMakeFiles/CMakeTmp'
/usr/bin/cmake -E cmake_progress_report /tmp/build/CMakeFiles/CMakeTmp/CMakeFiles 1
Building C object CMakeFiles/cmTryCompileExec410970413.dir/src.c.o
/bin/cc   -fexcess-precision=fast -std=gnu99  -DC__Wpointer_arith_VALID -fPIE   -fexcess-precision=fast -Wpointer-arith -o CMakeFiles/cmTryCompileExec410970413.dir/src.c.o   -c /tmp/build/CMakeFiles/CMakeTmp/src.c
Linking C executable cmTryCompileExec410970413
/usr/bin/cmake -E cmake_link_script CMakeFiles/cmTryCompileExec410970413.dir/link.txt --verbose=1
/bin/cc   -fexcess-precision=fast -std=gnu99  -DC__Wpointer_arith_VALID    CMakeFiles/cmTryCompileExec410970413.dir/src.c.o  -o cmTryCompileExec410970413 -rdynamic 
gmake[1]: Leaving directory `/tmp/build/CMakeFiles/CMakeTmp'

Source file was:
int main(void) { return 0; }
Performing C SOURCE FILE Test C__Wformat_security_VALID succeded with the following output:
Change Dir: /tmp/build/CMakeFiles/CMakeTmp

Run Build Command:/bin/gmake "cmTryCompileExec3926955363/fast"
/bin/gmake -f CMakeFiles/cmTryCompileExec3926955363.dir/build.make CMakeFiles/cmTryCompileExec3926955363.dir/build
gmake[1]: Entering directory `/tmp/build/CMakeFiles/CMakeTmp'
/usr/bin/cmake -E cmake_progress_report /tmp/build/CMakeFiles/CMakeTmp/CMakeFiles 1
Building C object CMakeFiles/cmTryCompileExec3926955363.dir/src.c.o
/bin/cc   -fexcess-precision=fast -std=gnu99  -DC__Wformat_security_VALID -fPIE   -fexcess-precision=fast -Wformat-security -o CMakeFiles/cmTryCompileExec3926955363.dir/src.c.o   -c /tmp/build/CMakeFiles/CMakeTmp/src.c
cc1: warning: -Wformat-security ignored without -Wformat [-Wformat-security]
Linking C executable cmTryCompileExec3926955363
/usr/bin/cmake -E cmake_link_script CMakeFiles/cmTryCompileExec3926955363.dir/link.txt --verbose=1
/bin/cc   -fexcess-precision=fast -std=gnu99  -DC__Wformat_security_VALID    CMakeFiles/cmTryCompileExec3926955363.dir/src.c.o  -o cmTryCompileExec3926955363 -rdynamic 
gmake[1]: Leaving directory `/tmp/build/CMakeFiles/CMakeTmp'

Source file was:
int main(void) { return 0; }
Performing C SOURCE FILE Test C__fwrapv_VALID succeded with the following output:
Change Dir: /tmp/build/CMakeFiles/CMakeTmp

Run Build Command:/bin/gmake "cmTryCompileExec530056664/fast"
/bin/gmake -f CMakeFiles/cmTryCompileExec530056664.dir/build.make CMakeFiles/cmTryCompileExec530056664.dir/build
gmake[1]: Entering directory `/tmp/build/CMakeFiles/CMakeTmp'
/usr/bin/cmake -E cmake_progress_report /tmp/build/CMakeFiles/CMakeTmp/CMakeFiles 1
Building C object CMakeFiles/cmTryCompileExec530056664.dir/src.c.o
/bin/cc   -fexcess-precision=fast -std=gnu99  -DC__fwrapv_VALID -fPIE   -fexcess-precision=fast -fwrapv -o CMakeFiles/cmTryCompileExec530056664.dir/src.c.o   -c /tmp/build/CMakeFiles/CMakeTmp/src.c
Linking C executable cmTryCompileExec530056664
/usr/bin/cmake -E cmake_link_script CMakeFiles/cmTryCompileExec530056664.dir/link.txt --verbose=1
/bin/cc   -fexcess-precision=fast -std=gnu99  -DC__fwrapv_VALID    CMakeFiles/cmTryCompileExec530056664.dir/src.c.o  -o cmTryCompileExec530056664 -rdynamic 
gmake[1]: Leaving directory `/tmp/build/CMakeFiles/CMakeTmp'

Source file was:
int main(void) { return 0; }
Performing C SOURCE FILE Test C__fno_strict_overflow_VALID succeded with the following output:
Change Dir: /tmp/build/CMakeFiles/CMakeTmp

Run Build Command:/bin/gmake "cmTryCompileExec2202758702/fast"
/bin/gmake -f CMakeFiles/cmTryCompileExec2202758702.dir/build.make CMakeFiles/cmTryCompileExec2202758702.dir/build
gmake[1]: Entering directory `/tmp/build/CMakeFiles/CMakeTmp'
/usr/bin/cmake -E cmake_progress_report /tmp/build/CMakeFiles/CMakeTmp/CMakeFiles 1
Building C object CMakeFiles/cmTryCompileExec2202758702.dir/src.c.o
/bin/cc   -fexcess-precision=fast -std=gnu99  -DC__fno_strict_overflow_VALID -fPIE   -fexcess-precision=fast -fno-strict-overflow -o CMakeFiles/cmTryCompileExec2202758702.dir/src.c.o   -c /tmp/build/CMakeFiles/CMakeTmp/src.c
Linking C executable cmTryCompileExec2202758702
/usr/bin/cmake -E cmake_link_script CMakeFiles/cmTryCompileExec2202758702.dir/link.txt --verbose=1
/bin/cc   -fexcess-precision=fast -std=gnu99  -DC__fno_strict_overflow_VALID    CMakeFiles/cmTryCompileExec2202758702.dir/src.c.o  -o cmTryCompileExec2202758702 -rdynamic 
gmake[1]: Leaving directory `/tmp/build/CMakeFiles/CMakeTmp'

Source file was:
int main(void) { return 0; }
Performing C SOURCE FILE Test C__Wvla_VALID succeded with the following output:
Change Dir: /tmp/build/CMakeFiles/CMakeTmp

Run Build Command:/bin/gmake "cmTryCompileExec763799744/fast"
/bin/gmake -f CMakeFiles/cmTryCompileExec763799744.dir/build.make CMakeFiles/cmTryCompileExec763799744.dir/build
gmake[1]: Entering directory `/tmp/build/CMakeFiles/CMakeTmp'
/usr/bin/cmake -E cmake_progress_report /tmp/build/CMakeFiles/CMakeTmp/CMakeFiles 1
Building C object CMakeFiles/cmTryCompileExec763799744.dir/src.c.o
/bin/cc   -fexcess-precision=fast -std=gnu99  -DC__Wvla_VALID -fPIE   -fexcess-precision=fast -Wvla -o CMakeFiles/cmTryCompileExec763799744.dir/src.c.o   -c /tmp/build/CMakeFiles/CMakeTmp/src.c
Linking C executable cmTryCompileExec763799744
/usr/bin/cmake -E cmake_link_script CMakeFiles/cmTryCompileExec763799744.dir/link.txt --verbose=1
/bin/cc   -fexcess-precision=fast -std=gnu99  -DC__Wvla_VALID    CMakeFiles/cmTryCompileExec763799744.dir/src.c.o  -o cmTryCompileExec763799744 -rdynamic 
gmake[1]: Leaving directory `/tmp/build/CMakeFiles/CMakeTmp'

Source file was:
int main(void) { return 0; }
Performing C SOURCE FILE Test C__Waddress_VALID succeded with the following output:
Change Dir: /tmp/build/CMakeFiles/CMakeTmp

Run Build Command:/bin/gmake "cmTryCompileExec3186744056/fast"
/bin/gmake -f CMakeFiles/cmTryCompileExec3186744056.dir/build.make CMakeFiles/cmTryCompileExec3186744056.dir/build
gmake[1]: Entering directory `/tmp/build/CMakeFiles/CMakeTmp'
/usr/bin/cmake -E cmake_progress_report /tmp/build/CMakeFiles/CMakeTmp/CMakeFiles 1
Building C object CMakeFiles/cmTryCompileExec3186744056.dir/src.c.o
/bin/cc   -fexcess-precision=fast -std=gnu99  -DC__Waddress_VALID -fPIE   -fexcess-precision=fast -Waddress -o CMakeFiles/cmTryCompileExec3186744056.dir/src.c.o   -c /tmp/build/CMakeFiles/CMakeTmp/src.c
Linking C executable cmTryCompileExec3186744056
/usr/bin/cmake -E cmake_link_script CMakeFiles/cmTryCompileExec3186744056.dir/link.txt --verbose=1
/bin/cc   -fexcess-precision=fast -std=gnu99  -DC__Waddress_VALID    CMakeFiles/cmTryCompileExec3186744056.dir/src.c.o  -o cmTryCompileExec3186744056 -rdynamic 
gmake[1]: Leaving directory `/tmp/build/CMakeFiles/CMakeTmp'

Source file was:
int main(void) { return 0; }
Performing C SOURCE FILE Test C__Wattributes_VALID succeded with the following output:
Change Dir: /tmp/build/CMakeFiles/CMakeTmp

Run Build Command:/bin/gmake "cmTryCompileExec2430501981/fast"
/bin/gmake -f CMakeFiles/cmTryCompileExec2430501981.dir/build.make CMakeFiles/cmTryCompileExec2430501981.dir/build
gmake[1]: Entering directory `/tmp/build/CMakeFiles/CMakeTmp'
/usr/bin/cmake -E cmake_progress_report /tmp/build/CMakeFiles/CMakeTmp/CMakeFiles 1
Building C object CMakeFiles/cmTryCompileExec2430501981.dir/src.c.o
/bin/cc   -fexcess-precision=fast -std=gnu99  -DC__Wattributes_VALID -fPIE   -fexcess-precision=fast -Wattributes -o CMakeFiles/cmTryCompileExec2430501981.dir/src.c.o   -c /tmp/build/CMakeFiles/CMakeTmp/src.c
Linking C executable cmTryCompileExec2430501981
/usr/bin/cmake -E cmake_link_script CMakeFiles/cmTryCompileExec2430501981.dir/link.txt --verbose=1
/bin/cc   -fexcess-precision=fast -std=gnu99  -DC__Wattributes_VALID    CMakeFiles/cmTryCompileExec2430501981.dir/src.c.o  -o cmTryCompileExec2430501981 -rdynamic 
gmake[1]: Leaving directory `/tmp/build/CMakeFiles/CMakeTmp'

Source file was:
int main(void) { return 0; }
Performing C SOURCE FILE Test C__Wdiv_by_zero_VALID succeded with the following output:
Change Dir: /tmp/build/CMakeFiles/CMakeTmp

Run Build Command:/bin/gmake "cmTryCompileExec3598884276/fast"
/bin/gmake -f CMakeFiles/cmTryCompileExec3598884276.dir/build.make CMakeFiles/cmTryCompileExec3598884276.dir/build
gmake[1]: Entering directory `/tmp/build/CMakeFiles/CMakeTmp'
/usr/bin/cmake -E cmake_progress_report /tmp/build/CMakeFiles/CMakeTmp/CMakeFiles 1
Building C object CMakeFiles/cmTryCompileExec3598884276.dir/src.c.o
/bin/cc   -fexcess-precision=fast -std=gnu99  -DC__Wdiv_by_zero_VALID -fPIE   -fexcess-precision=fast -Wdiv-by-zero -o CMakeFiles/cmTryCompileExec3598884276.dir/src.c.o   -c /tmp/build/CMakeFiles/CMakeTmp/src.c
Linking C executable cmTryCompileExec3598884276
/usr/bin/cmake -E cmake_link_script CMakeFiles/cmTryCompileExec3598884276.dir/link.txt --verbose=1
/bin/cc   -fexcess-precision=fast -std=gnu99  -DC__Wdiv_by_zero_VALID    CMakeFiles/cmTryCompileExec3598884276.dir/src.c.o  -o cmTryCompileExec3598884276 -rdynamic 
gmake[1]: Leaving directory `/tmp/build/CMakeFiles/CMakeTmp'

Source file was:
int main(void) { return 0; }
Performing C SOURCE FILE Test C__Wignored_qualifiers_VALID succeded with the following output:
Change Dir: /tmp/build/CMakeFiles/CMakeTmp

Run Build Command:/bin/gmake "cmTryCompileExec1467136292/fast"
/bin/gmake -f CMakeFiles/cmTryCompileExec1467136292.dir/build.make CMakeFiles/cmTryCompileExec1467136292.dir/build
gmake[1]: Entering directory `/tmp/build/CMakeFiles/CMakeTmp'
/usr/bin/cmake -E cmake_progress_report /tmp/build/CMakeFiles/CMakeTmp/CMakeFiles 1
Building C object CMakeFiles/cmTryCompileExec1467136292.dir/src.c.o
/bin/cc   -fexcess-precision=fast -std=gnu99  -DC__Wignored_qualifiers_VALID -fPIE   -fexcess-precision=fast -Wignored-qualifiers -o CMakeFiles/cmTryCompileExec1467136292.dir/src.c.o   -c /tmp/build/CMakeFiles/CMakeTmp/src.c
Linking C executable cmTryCompileExec1467136292
/usr/bin/cmake -E cmake_link_script CMakeFiles/cmTryCompileExec1467136292.dir/link.txt --verbose=1
/bin/cc   -fexcess-precision=fast -std=gnu99  -DC__Wignored_qualifiers_VALID    CMakeFiles/cmTryCompileExec1467136292.dir/src.c.o  -o cmTryCompileExec1467136292 -rdynamic 
gmake[1]: Leaving directory `/tmp/build/CMakeFiles/CMakeTmp'

Source file was:
int main(void) { return 0; }
Performing C SOURCE FILE Test C__Wpragmas_VALID succeded with the following output:
Change Dir: /tmp/build/CMakeFiles/CMakeTmp

Run Build Command:/bin/gmake "cmTryCompileExec1163110746/fast"
/bin/gmake -f CMakeFiles/cmTryCompileExec1163110746.dir/build.make CMakeFiles/cmTryCompileExec1163110746.dir/build
gmake[1]: Entering directory `/tmp/build/CMakeFiles/CMakeTmp'
/usr/bin/cmake -E cmake_progress_report /tmp/build/CMakeFiles/CMakeTmp/CMakeFiles 1
Building C object CMakeFiles/cmTryCompileExec1163110746.dir/src.c.o
/bin/cc   -fexcess-precision=fast -std=gnu99  -DC__Wpragmas_VALID -fPIE   -fexcess-precision=fast -Wpragmas -o CMakeFiles/cmTryCompileExec1163110746.dir/src.c.o   -c /tmp/build/CMakeFiles/CMakeTmp/src.c
Linking C executable cmTryCompileExec1163110746
/usr/bin/cmake -E cmake_link_script CMakeFiles/cmTryCompileExec1163110746.dir/link.txt --verbose=1
/bin/cc   -fexcess-precision=fast -std=gnu99  -DC__Wpragmas_VALID    CMakeFiles/cmTryCompileExec1163110746.dir/src.c.o  -o cmTryCompileExec1163110746 -rdynamic 
gmake[1]: Leaving directory `/tmp/build/CMakeFiles/CMakeTmp'

Source file was:
int main(void) { return 0; }
Performing C SOURCE FILE Test C__Wno_overlength_strings_VALID succeded with the following output:
Change Dir: /tmp/build/CMakeFiles/CMakeTmp

Run Build Command:/bin/gmake "cmTryCompileExec888453809/fast"
/bin/gmake -f CMakeFiles/cmTryCompileExec888453809.dir/build.make CMakeFiles/cmTryCompileExec888453809.dir/build
gmake[1]: Entering directory `/tmp/build/CMakeFiles/CMakeTmp'
/usr/bin/cmake -E cmake_progress_report /tmp/build/CMakeFiles/CMakeTmp/CMakeFiles 1
Building C object CMakeFiles/cmTryCompileExec888453809.dir/src.c.o
/bin/cc   -fexcess-precision=fast -std=gnu99  -DC__Wno_overlength_strings_VALID -fPIE   -fexcess-precision=fast -Wno-overlength-strings -o CMakeFiles/cmTryCompileExec888453809.dir/src.c.o   -c /tmp/build/CMakeFiles/CMakeTmp/src.c
Linking C executable cmTryCompileExec888453809
/usr/bin/cmake -E cmake_link_script CMakeFiles/cmTryCompileExec888453809.dir/link.txt --verbose=1
/bin/cc   -fexcess-precision=fast -std=gnu99  -DC__Wno_overlength_strings_VALID    CMakeFiles/cmTryCompileExec888453809.dir/src.c.o  -o cmTryCompileExec888453809 -rdynamic 
gmake[1]: Leaving directory `/tmp/build/CMakeFiles/CMakeTmp'

Source file was:
int main(void) { return 0; }
Performing C SOURCE FILE Test C__Wno_long_long_VALID succeded with the following output:
Change Dir: /tmp/build/CMakeFiles/CMakeTmp

Run Build Command:/bin/gmake "cmTryCompileExec2875298746/fast"
/bin/gmake -f CMakeFiles/cmTryCompileExec2875298746.dir/build.make CMakeFiles/cmTryCompileExec2875298746.dir/build
gmake[1]: Entering directory `/tmp/build/CMakeFiles/CMakeTmp'
/usr/bin/cmake -E cmake_progress_report /tmp/build/CMakeFiles/CMakeTmp/CMakeFiles 1
Building C object CMakeFiles/cmTryCompileExec2875298746.dir/src.c.o
/bin/cc   -fexcess-precision=fast -std=gnu99  -DC__Wno_long_long_VALID -fPIE   -fexcess-precision=fast -Wno-long-long -o CMakeFiles/cmTryCompileExec2875298746.dir/src.c.o   -c /tmp/build/CMakeFiles/CMakeTmp/src.c
Linking C executable cmTryCompileExec2875298746
/usr/bin/cmake -E cmake_link_script CMakeFiles/cmTryCompileExec2875298746.dir/link.txt --verbose=1
/bin/cc   -fexcess-precision=fast -std=gnu99  -DC__Wno_long_long_VALID    CMakeFiles/cmTryCompileExec2875298746.dir/src.c.o  -o cmTryCompileExec2875298746 -rdynamic 
gmake[1]: Leaving directory `/tmp/build/CMakeFiles/CMakeTmp'

Source file was:
int main(void) { return 0; }
Performing C SOURCE FILE Test C__Wframe_larger_than_32768_VALID succeded with the following output:
Change Dir: /tmp/build/CMakeFiles/CMakeTmp

Run Build Command:/bin/gmake "cmTryCompileExec3350089384/fast"
/bin/gmake -f CMakeFiles/cmTryCompileExec3350089384.dir/build.make CMakeFiles/cmTryCompileExec3350089384.dir/build
gmake[1]: Entering directory `/tmp/build/CMakeFiles/CMakeTmp'
/usr/bin/cmake -E cmake_progress_report /tmp/build/CMakeFiles/CMakeTmp/CMakeFiles 1
Building C object CMakeFiles/cmTryCompileExec3350089384.dir/src.c.o
/bin/cc   -fexcess-precision=fast -std=gnu99  -DC__Wframe_larger_than_32768_VALID -fPIE   -fexcess-precision=fast -Wframe-larger-than=32768 -o CMakeFiles/cmTryCompileExec3350089384.dir/src.c.o   -c /tmp/build/CMakeFiles/CMakeTmp/src.c
Linking C executable cmTryCompileExec3350089384
/usr/bin/cmake -E cmake_link_script CMakeFiles/cmTryCompileExec3350089384.dir/link.txt --verbose=1
/bin/cc   -fexcess-precision=fast -std=gnu99  -DC__Wframe_larger_than_32768_VALID    CMakeFiles/cmTryCompileExec3350089384.dir/src.c.o  -o cmTryCompileExec3350089384 -rdynamic 
gmake[1]: Leaving directory `/tmp/build/CMakeFiles/CMakeTmp'

Source file was:
int main(void) { return 0; }
Performing C SOURCE FILE Test C__Wc_compat_VALID succeded with the following output:
Change Dir: /tmp/build/CMakeFiles/CMakeTmp

Run Build Command:/bin/gmake "cmTryCompileExec2996547733/fast"
/bin/gmake -f CMakeFiles/cmTryCompileExec2996547733.dir/build.make CMakeFiles/cmTryCompileExec2996547733.dir/build
gmake[1]: Entering directory `/tmp/build/CMakeFiles/CMakeTmp'
/usr/bin/cmake -E cmake_progress_report /tmp/build/CMakeFiles/CMakeTmp/CMakeFiles 1
Building C object CMakeFiles/cmTryCompileExec2996547733.dir/src.c.o
/bin/cc   -fexcess-precision=fast -std=gnu99  -DC__Wc_compat_VALID -fPIE   -fexcess-precision=fast -Wc++-compat -o CMakeFiles/cmTryCompileExec2996547733.dir/src.c.o   -c /tmp/build/CMakeFiles/CMakeTmp/src.c
Linking C executable cmTryCompileExec2996547733
/usr/bin/cmake -E cmake_link_script CMakeFiles/cmTryCompileExec2996547733.dir/link.txt --verbose=1
/bin/cc   -fexcess-precision=fast -std=gnu99  -DC__Wc_compat_VALID    CMakeFiles/cmTryCompileExec2996547733.dir/src.c.o  -o cmTryCompileExec2996547733 -rdynamic 
gmake[1]: Leaving directory `/tmp/build/CMakeFiles/CMakeTmp'

Source file was:
int main(void) { return 0; }
Performing C SOURCE FILE Test C__Wshadow_VALID succeded with the following output:
Change Dir: /tmp/build/CMakeFiles/CMakeTmp

Run Build Command:/bin/gmake "cmTryCompileExec492141475/fast"
/bin/gmake -f CMakeFiles/cmTryCompileExec492141475.dir/build.make CMakeFiles/cmTryCompileExec492141475.dir/build
gmake[1]: Entering directory `/tmp/build/CMakeFiles/CMakeTmp'
/usr/bin/cmake -E cmake_progress_report /tmp/build/CMakeFiles/CMakeTmp/CMakeFiles 1
Building C object CMakeFiles/cmTryCompileExec492141475.dir/src.c.o
/bin/cc   -fexcess-precision=fast -std=gnu99  -DC__Wshadow_VALID -fPIE   -fexcess-precision=fast -Wshadow -o CMakeFiles/cmTryCompileExec492141475.dir/src.c.o   -c /tmp/build/CMakeFiles/CMakeTmp/src.c
Linking C executable cmTryCompileExec492141475
/usr/bin/cmake -E cmake_link_script CMakeFiles/cmTryCompileExec492141475.dir/link.txt --verbose=1
/bin/cc   -fexcess-precision=fast -std=gnu99  -DC__Wshadow_VALID    CMakeFiles/cmTryCompileExec492141475.dir/src.c.o  -o cmTryCompileExec492141475 -rdynamic 
gmake[1]: Leaving directory `/tmp/build/CMakeFiles/CMakeTmp'

Source file was:
int main(void) { return 0; }
Performing C SOURCE FILE Test C__Wno_pointer_sign_VALID succeded with the following output:
Change Dir: /tmp/build/CMakeFiles/CMakeTmp

Run Build Command:/bin/gmake "cmTryCompileExec3855165738/fast"
/bin/gmake -f CMakeFiles/cmTryCompileExec3855165738.dir/build.make CMakeFiles/cmTryCompileExec3855165738.dir/build
gmake[1]: Entering directory `/tmp/build/CMakeFiles/CMakeTmp'
/usr/bin/cmake -E cmake_progress_report /tmp/build/CMakeFiles/CMakeTmp/CMakeFiles 1
Building C object CMakeFiles/cmTryCompileExec3855165738.dir/src.c.o
/bin/cc   -fexcess-precision=fast -std=gnu99  -DC__Wno_pointer_sign_VALID -fPIE   -fexcess-precision=fast -Wno-pointer-sign -o CMakeFiles/cmTryCompileExec3855165738.dir/src.c.o   -c /tmp/build/CMakeFiles/CMakeTmp/src.c
Linking C executable cmTryCompileExec3855165738
/usr/bin/cmake -E cmake_link_script CMakeFiles/cmTryCompileExec3855165738.dir/link.txt --verbose=1
/bin/cc   -fexcess-precision=fast -std=gnu99  -DC__Wno_pointer_sign_VALID    CMakeFiles/cmTryCompileExec3855165738.dir/src.c.o  -o cmTryCompileExec3855165738 -rdynamic 
gmake[1]: Leaving directory `/tmp/build/CMakeFiles/CMakeTmp'

Source file was:
int main(void) { return 0; }
Performing C SOURCE FILE Test C__Wold_style_definition_VALID succeded with the following output:
Change Dir: /tmp/build/CMakeFiles/CMakeTmp

Run Build Command:/bin/gmake "cmTryCompileExec3046795283/fast"
/bin/gmake -f CMakeFiles/cmTryCompileExec3046795283.dir/build.make CMakeFiles/cmTryCompileExec3046795283.dir/build
gmake[1]: Entering directory `/tmp/build/CMakeFiles/CMakeTmp'
/usr/bin/cmake -E cmake_progress_report /tmp/build/CMakeFiles/CMakeTmp/CMakeFiles 1
Building C object CMakeFiles/cmTryCompileExec3046795283.dir/src.c.o
/bin/cc   -fexcess-precision=fast -std=gnu99  -DC__Wold_style_definition_VALID -fPIE   -fexcess-precision=fast -Wold-style-definition -o CMakeFiles/cmTryCompileExec3046795283.dir/src.c.o   -c /tmp/build/CMakeFiles/CMakeTmp/src.c
Linking C executable cmTryCompileExec3046795283
/usr/bin/cmake -E cmake_link_script CMakeFiles/cmTryCompileExec3046795283.dir/link.txt --verbose=1
/bin/cc   -fexcess-precision=fast -std=gnu99  -DC__Wold_style_definition_VALID    CMakeFiles/cmTryCompileExec3046795283.dir/src.c.o  -o cmTryCompileExec3046795283 -rdynamic 
gmake[1]: Leaving directory `/tmp/build/CMakeFiles/CMakeTmp'

Source file was:
int main(void) { return 0; }
Performing C SOURCE FILE Test C__Wstrict_prototypes_VALID succeded with the following output:
Change Dir: /tmp/build/CMakeFiles/CMakeTmp

Run Build Command:/bin/gmake "cmTryCompileExec3301213060/fast"
/bin/gmake -f CMakeFiles/cmTryCompileExec3301213060.dir/build.make CMakeFiles/cmTryCompileExec3301213060.dir/build
gmake[1]: Entering directory `/tmp/build/CMakeFiles/CMakeTmp'
/usr/bin/cmake -E cmake_progress_report /tmp/build/CMakeFiles/CMakeTmp/CMakeFiles 1
Building C object CMakeFiles/cmTryCompileExec3301213060.dir/src.c.o
/bin/cc   -fexcess-precision=fast -std=gnu99  -DC__Wstrict_prototypes_VALID -fPIE   -fexcess-precision=fast -Wstrict-prototypes -o CMakeFiles/cmTryCompileExec3301213060.dir/src.c.o   -c /tmp/build/CMakeFiles/CMakeTmp/src.c
Linking C executable cmTryCompileExec3301213060
/usr/bin/cmake -E cmake_link_script CMakeFiles/cmTryCompileExec3301213060.dir/link.txt --verbose=1
/bin/cc   -fexcess-precision=fast -std=gnu99  -DC__Wstrict_prototypes_VALID    CMakeFiles/cmTryCompileExec3301213060.dir/src.c.o  -o cmTryCompileExec3301213060 -rdynamic 
gmake[1]: Leaving directory `/tmp/build/CMakeFiles/CMakeTmp'

Source file was:
int main(void) { return 0; }
Performing C SOURCE FILE Test C__Wlogical_op_VALID succeded with the following output:
Change Dir: /tmp/build/CMakeFiles/CMakeTmp

Run Build Command:/bin/gmake "cmTryCompileExec546689523/fast"
/bin/gmake -f CMakeFiles/cmTryCompileExec546689523.dir/build.make CMakeFiles/cmTryCompileExec546689523.dir/build
gmake[1]: Entering directory `/tmp/build/CMakeFiles/CMakeTmp'
/usr/bin/cmake -E cmake_progress_report /tmp/build/CMakeFiles/CMakeTmp/CMakeFiles 1
Building C object CMakeFiles/cmTryCompileExec546689523.dir/src.c.o
/bin/cc   -fexcess-precision=fast -std=gnu99  -DC__Wlogical_op_VALID -fPIE   -fexcess-precision=fast -Wlogical-op -o CMakeFiles/cmTryCompileExec546689523.dir/src.c.o   -c /tmp/build/CMakeFiles/CMakeTmp/src.c
Linking C executable cmTryCompileExec546689523
/usr/bin/cmake -E cmake_link_script CMakeFiles/cmTryCompileExec546689523.dir/link.txt --verbose=1
/bin/cc   -fexcess-precision=fast -std=gnu99  -DC__Wlogical_op_VALID    CMakeFiles/cmTryCompileExec546689523.dir/src.c.o  -o cmTryCompileExec546689523 -rdynamic 
gmake[1]: Leaving directory `/tmp/build/CMakeFiles/CMakeTmp'

Source file was:
int main(void) { return 0; }
Performing C SOURCE FILE Test C__Wjump_misses_init_VALID succeded with the following output:
Change Dir: /tmp/build/CMakeFiles/CMakeTmp

Run Build Command:/bin/gmake "cmTryCompileExec1616755428/fast"
/bin/gmake -f CMakeFiles/cmTryCompileExec1616755428.dir/build.make CMakeFiles/cmTryCompileExec1616755428.dir/build
gmake[1]: Entering directory `/tmp/build/CMakeFiles/CMakeTmp'
/usr/bin/cmake -E cmake_progress_report /tmp/build/CMakeFiles/CMakeTmp/CMakeFiles 1
Building C object CMakeFiles/cmTryCompileExec1616755428.dir/src.c.o
/bin/cc   -fexcess-precision=fast -std=gnu99  -DC__Wjump_misses_init_VALID -fPIE   -fexcess-precision=fast -Wjump-misses-init -o CMakeFiles/cmTryCompileExec1616755428.dir/src.c.o   -c /tmp/build/CMakeFiles/CMakeTmp/src.c
Linking C executable cmTryCompileExec1616755428
/usr/bin/cmake -E cmake_link_script CMakeFiles/cmTryCompileExec1616755428.dir/link.txt --verbose=1
/bin/cc   -fexcess-precision=fast -std=gnu99  -DC__Wjump_misses_init_VALID    CMakeFiles/cmTryCompileExec1616755428.dir/src.c.o  -o cmTryCompileExec1616755428 -rdynamic 
gmake[1]: Leaving directory `/tmp/build/CMakeFiles/CMakeTmp'

Source file was:
int main(void) { return 0; }
Performing C SOURCE FILE Test C__Werror_implicit_VALID succeded with the following output:
Change Dir: /tmp/build/CMakeFiles/CMakeTmp

Run Build Command:/bin/gmake "cmTryCompileExec2665687894/fast"
/bin/gmake -f CMakeFiles/cmTryCompileExec2665687894.dir/build.make CMakeFiles/cmTryCompileExec2665687894.dir/build
gmake[1]: Entering directory `/tmp/build/CMakeFiles/CMakeTmp'
/usr/bin/cmake -E cmake_progress_report /tmp/build/CMakeFiles/CMakeTmp/CMakeFiles 1
Building C object CMakeFiles/cmTryCompileExec2665687894.dir/src.c.o
/bin/cc   -fexcess-precision=fast -std=gnu99  -DC__Werror_implicit_VALID -fPIE   -fexcess-precision=fast -Werror=implicit -o CMakeFiles/cmTryCompileExec2665687894.dir/src.c.o   -c /tmp/build/CMakeFiles/CMakeTmp/src.c
Linking C executable cmTryCompileExec2665687894
/usr/bin/cmake -E cmake_link_script CMakeFiles/cmTryCompileExec2665687894.dir/link.txt --verbose=1
/bin/cc   -fexcess-precision=fast -std=gnu99  -DC__Werror_implicit_VALID    CMakeFiles/cmTryCompileExec2665687894.dir/src.c.o  -o cmTryCompileExec2665687894 -rdynamic 
gmake[1]: Leaving directory `/tmp/build/CMakeFiles/CMakeTmp'

Source file was:
int main(void) { return 0; }
Performing C++ SOURCE FILE Test CXX__Wall_VALID succeded with the following output:
Change Dir: /tmp/build/CMakeFiles/CMakeTmp

Run Build Command:/bin/gmake "cmTryCompileExec3516424840/fast"
/bin/gmake -f CMakeFiles/cmTryCompileExec3516424840.dir/build.make CMakeFiles/cmTryCompileExec3516424840.dir/build
gmake[1]: Entering directory `/tmp/build/CMakeFiles/CMakeTmp'
/usr/bin/cmake -E cmake_progress_report /tmp/build/CMakeFiles/CMakeTmp/CMakeFiles 1
Building CXX object CMakeFiles/cmTryCompileExec3516424840.dir/src.cxx.o
/bin/c++    -fexcess-precision=fast  -DCXX__Wall_VALID -fPIE   -fexcess-precision=fast -Wall -o CMakeFiles/cmTryCompileExec3516424840.dir/src.cxx.o -c /tmp/build/CMakeFiles/CMakeTmp/src.cxx
Linking CXX executable cmTryCompileExec3516424840
/usr/bin/cmake -E cmake_link_script CMakeFiles/cmTryCompileExec3516424840.dir/link.txt --verbose=1
/bin/c++    -fexcess-precision=fast  -DCXX__Wall_VALID    CMakeFiles/cmTryCompileExec3516424840.dir/src.cxx.o  -o cmTryCompileExec3516424840 -rdynamic 
gmake[1]: Leaving directory `/tmp/build/CMakeFiles/CMakeTmp'

Source file was:
int main(void) { return 0; }
Performing C++ SOURCE FILE Test CXX__Wextra_VALID succeded with the following output:
Change Dir: /tmp/build/CMakeFiles/CMakeTmp

Run Build Command:/bin/gmake "cmTryCompileExec3486500370/fast"
/bin/gmake -f CMakeFiles/cmTryCompileExec3486500370.dir/build.make CMakeFiles/cmTryCompileExec3486500370.dir/build
gmake[1]: Entering directory `/tmp/build/CMakeFiles/CMakeTmp'
/usr/bin/cmake -E cmake_progress_report /tmp/build/CMakeFiles/CMakeTmp/CMakeFiles 1
Building CXX object CMakeFiles/cmTryCompileExec3486500370.dir/src.cxx.o
/bin/c++    -fexcess-precision=fast  -DCXX__Wextra_VALID -fPIE   -fexcess-precision=fast -Wextra -o CMakeFiles/cmTryCompileExec3486500370.dir/src.cxx.o -c /tmp/build/CMakeFiles/CMakeTmp/src.cxx
Linking CXX executable cmTryCompileExec3486500370
/usr/bin/cmake -E cmake_link_script CMakeFiles/cmTryCompileExec3486500370.dir/link.txt --verbose=1
/bin/c++    -fexcess-precision=fast  -DCXX__Wextra_VALID    CMakeFiles/cmTryCompileExec3486500370.dir/src.cxx.o  -o cmTryCompileExec3486500370 -rdynamic 
gmake[1]: Leaving directory `/tmp/build/CMakeFiles/CMakeTmp'

Source file was:
int main(void) { return 0; }
Performing C++ SOURCE FILE Test CXX__Wendif_labels_VALID succeded with the following output:
Change Dir: /tmp/build/CMakeFiles/CMakeTmp

Run Build Command:/bin/gmake "cmTryCompileExec3608434621/fast"
/bin/gmake -f CMakeFiles/cmTryCompileExec3608434621.dir/build.make CMakeFiles/cmTryCompileExec3608434621.dir/build
gmake[1]: Entering directory `/tmp/build/CMakeFiles/CMakeTmp'
/usr/bin/cmake -E cmake_progress_report /tmp/build/CMakeFiles/CMakeTmp/CMakeFiles 1
Building CXX object CMakeFiles/cmTryCompileExec3608434621.dir/src.cxx.o
/bin/c++    -fexcess-precision=fast  -DCXX__Wendif_labels_VALID -fPIE   -fexcess-precision=fast -Wendif-labels -o CMakeFiles/cmTryCompileExec3608434621.dir/src.cxx.o -c /tmp/build/CMakeFiles/CMakeTmp/src.cxx
Linking CXX executable cmTryCompileExec3608434621
/usr/bin/cmake -E cmake_link_script CMakeFiles/cmTryCompileExec3608434621.dir/link.txt --verbose=1
/bin/c++    -fexcess-precision=fast  -DCXX__Wendif_labels_VALID    CMakeFiles/cmTryCompileExec3608434621.dir/src.cxx.o  -o cmTryCompileExec3608434621 -rdynamic 
gmake[1]: Leaving directory `/tmp/build/CMakeFiles/CMakeTmp'

Source file was:
int main(void) { return 0; }
Performing C++ SOURCE FILE Test CXX__Wpointer_arith_VALID succeded with the following output:
Change Dir: /tmp/build/CMakeFiles/CMakeTmp

Run Build Command:/bin/gmake "cmTryCompileExec4058506729/fast"
/bin/gmake -f CMakeFiles/cmTryCompileExec4058506729.dir/build.make CMakeFiles/cmTryCompileExec4058506729.dir/build
gmake[1]: Entering directory `/tmp/build/CMakeFiles/CMakeTmp'
/usr/bin/cmake -E cmake_progress_report /tmp/build/CMakeFiles/CMakeTmp/CMakeFiles 1
Building CXX object CMakeFiles/cmTryCompileExec4058506729.dir/src.cxx.o
/bin/c++    -fexcess-precision=fast  -DCXX__Wpointer_arith_VALID -fPIE   -fexcess-precision=fast -Wpointer-arith -o CMakeFiles/cmTryCompileExec4058506729.dir/src.cxx.o -c /tmp/build/CMakeFiles/CMakeTmp/src.cxx
Linking CXX executable cmTryCompileExec4058506729
/usr/bin/cmake -E cmake_link_script CMakeFiles/cmTryCompileExec4058506729.dir/link.txt --verbose=1
/bin/c++    -fexcess-precision=fast  -DCXX__Wpointer_arith_VALID    CMakeFiles/cmTryCompileExec4058506729.dir/src.cxx.o  -o cmTryCompileExec4058506729 -rdynamic 
gmake[1]: Leaving directory `/tmp/build/CMakeFiles/CMakeTmp'

Source file was:
int main(void) { return 0; }
Performing C++ SOURCE FILE Test CXX__Wformat_security_VALID succeded with the following output:
Change Dir: /tmp/build/CMakeFiles/CMakeTmp

Run Build Command:/bin/gmake "cmTryCompileExec834124712/fast"
/bin/gmake -f CMakeFiles/cmTryCompileExec834124712.dir/build.make CMakeFiles/cmTryCompileExec834124712.dir/build
gmake[1]: Entering directory `/tmp/build/CMakeFiles/CMakeTmp'
/usr/bin/cmake -E cmake_progress_report /tmp/build/CMakeFiles/CMakeTmp/CMakeFiles 1
Building CXX object CMakeFiles/cmTryCompileExec834124712.dir/src.cxx.o
/bin/c++    -fexcess-precision=fast  -DCXX__Wformat_security_VALID -fPIE   -fexcess-precision=fast -Wformat-security -o CMakeFiles/cmTryCompileExec834124712.dir/src.cxx.o -c /tmp/build/CMakeFiles/CMakeTmp/src.cxx
cc1plus: warning: -Wformat-security ignored without -Wformat [-Wformat-security]
Linking CXX executable cmTryCompileExec834124712
/usr/bin/cmake -E cmake_link_script CMakeFiles/cmTryCompileExec834124712.dir/link.txt --verbose=1
/bin/c++    -fexcess-precision=fast  -DCXX__Wformat_security_VALID    CMakeFiles/cmTryCompileExec834124712.dir/src.cxx.o  -o cmTryCompileExec834124712 -rdynamic 
gmake[1]: Leaving directory `/tmp/build/CMakeFiles/CMakeTmp'

Source file was:
int main(void) { return 0; }
Performing C++ SOURCE FILE Test CXX__fwrapv_VALID succeded with the following output:
Change Dir: /tmp/build/CMakeFiles/CMakeTmp

Run Build Command:/bin/gmake "cmTryCompileExec4107209212/fast"
/bin/gmake -f CMakeFiles/cmTryCompileExec4107209212.dir/build.make CMakeFiles/cmTryCompileExec4107209212.dir/build
gmake[1]: Entering directory `/tmp/build/CMakeFiles/CMakeTmp'
/usr/bin/cmake -E cmake_progress_report /tmp/build/CMakeFiles/CMakeTmp/CMakeFiles 1
Building CXX object CMakeFiles/cmTryCompileExec4107209212.dir/src.cxx.o
/bin/c++    -fexcess-precision=fast  -DCXX__fwrapv_VALID -fPIE   -fexcess-precision=fast -fwrapv -o CMakeFiles/cmTryCompileExec4107209212.dir/src.cxx.o -c /tmp/build/CMakeFiles/CMakeTmp/src.cxx
Linking CXX executable cmTryCompileExec4107209212
/usr/bin/cmake -E cmake_link_script CMakeFiles/cmTryCompileExec4107209212.dir/link.txt --verbose=1
/bin/c++    -fexcess-precision=fast  -DCXX__fwrapv_VALID    CMakeFiles/cmTryCompileExec4107209212.dir/src.cxx.o  -o cmTryCompileExec4107209212 -rdynamic 
gmake[1]: Leaving directory `/tmp/build/CMakeFiles/CMakeTmp'

Source file was:
int main(void) { return 0; }
Performing C++ SOURCE FILE Test CXX__fno_strict_overflow_VALID succeded with the following output:
Change Dir: /tmp/build/CMakeFiles/CMakeTmp

Run Build Command:/bin/gmake "cmTryCompileExec4275684097/fast"
/bin/gmake -f CMakeFiles/cmTryCompileExec4275684097.dir/build.make CMakeFiles/cmTryCompileExec4275684097.dir/build
gmake[1]: Entering directory `/tmp/build/CMakeFiles/CMakeTmp'
/usr/bin/cmake -E cmake_progress_report /tmp/build/CMakeFiles/CMakeTmp/CMakeFiles 1
Building CXX object CMakeFiles/cmTryCompileExec4275684097.dir/src.cxx.o
/bin/c++    -fexcess-precision=fast  -DCXX__fno_strict_overflow_VALID -fPIE   -fexcess-precision=fast -fno-strict-overflow -o CMakeFiles/cmTryCompileExec4275684097.dir/src.cxx.o -c /tmp/build/CMakeFiles/CMakeTmp/src.cxx
Linking CXX executable cmTryCompileExec4275684097
/usr/bin/cmake -E cmake_link_script CMakeFiles/cmTryCompileExec4275684097.dir/link.txt --verbose=1
/bin/c++    -fexcess-precision=fast  -DCXX__fno_strict_overflow_VALID    CMakeFiles/cmTryCompileExec4275684097.dir/src.cxx.o  -o cmTryCompileExec4275684097 -rdynamic 
gmake[1]: Leaving directory `/tmp/build/CMakeFiles/CMakeTmp'

Source file was:
int main(void) { return 0; }
Performing C++ SOURCE FILE Test CXX__Wvla_VALID succeded with the following output:
Change Dir: /tmp/build/CMakeFiles/CMakeTmp

Run Build Command:/bin/gmake "cmTryCompileExec4103400630/fast"
/bin/gmake -f CMakeFiles/cmTryCompileExec4103400630.dir/build.make CMakeFiles/cmTryCompileExec4103400630.dir/build
gmake[1]: Entering directory `/tmp/build/CMakeFiles/CMakeTmp'
/usr/bin/cmake -E cmake_progress_report /tmp/build/CMakeFiles/CMakeTmp/CMakeFiles 1
Building CXX object CMakeFiles/cmTryCompileExec4103400630.dir/src.cxx.o
/bin/c++    -fexcess-precision=fast  -DCXX__Wvla_VALID -fPIE   -fexcess-precision=fast -Wvla -o CMakeFiles/cmTryCompileExec4103400630.dir/src.cxx.o -c /tmp/build/CMakeFiles/CMakeTmp/src.cxx
Linking CXX executable cmTryCompileExec4103400630
/usr/bin/cmake -E cmake_link_script CMakeFiles/cmTryCompileExec4103400630.dir/link.txt --verbose=1
/bin/c++    -fexcess-precision=fast  -DCXX__Wvla_VALID    CMakeFiles/cmTryCompileExec4103400630.dir/src.cxx.o  -o cmTryCompileExec4103400630 -rdynamic 
gmake[1]: Leaving directory `/tmp/build/CMakeFiles/CMakeTmp'

Source file was:
int main(void) { return 0; }
Performing C++ SOURCE FILE Test CXX__Waddress_VALID succeded with the following output:
Change Dir: /tmp/build/CMakeFiles/CMakeTmp

Run Build Command:/bin/gmake "cmTryCompileExec2540238266/fast"
/bin/gmake -f CMakeFiles/cmTryCompileExec2540238266.dir/build.make CMakeFiles/cmTryCompileExec2540238266.dir/build
gmake[1]: Entering directory `/tmp/build/CMakeFiles/CMakeTmp'
/usr/bin/cmake -E cmake_progress_report /tmp/build/CMakeFiles/CMakeTmp/CMakeFiles 1
Building CXX object CMakeFiles/cmTryCompileExec2540238266.dir/src.cxx.o
/bin/c++    -fexcess-precision=fast  -DCXX__Waddress_VALID -fPIE   -fexcess-precision=fast -Waddress -o CMakeFiles/cmTryCompileExec2540238266.dir/src.cxx.o -c /tmp/build/CMakeFiles/CMakeTmp/src.cxx
Linking CXX executable cmTryCompileExec2540238266
/usr/bin/cmake -E cmake_link_script CMakeFiles/cmTryCompileExec2540238266.dir/link.txt --verbose=1
/bin/c++    -fexcess-precision=fast  -DCXX__Waddress_VALID    CMakeFiles/cmTryCompileExec2540238266.dir/src.cxx.o  -o cmTryCompileExec2540238266 -rdynamic 
gmake[1]: Leaving directory `/tmp/build/CMakeFiles/CMakeTmp'

Source file was:
int main(void) { return 0; }
Performing C++ SOURCE FILE Test CXX__Wattributes_VALID succeded with the following output:
Change Dir: /tmp/build/CMakeFiles/CMakeTmp

Run Build Command:/bin/gmake "cmTryCompileExec38740299/fast"
/bin/gmake -f CMakeFiles/cmTryCompileExec38740299.dir/build.make CMakeFiles/cmTryCompileExec38740299.dir/build
gmake[1]: Entering directory `/tmp/build/CMakeFiles/CMakeTmp'
/usr/bin/cmake -E cmake_progress_report /tmp/build/CMakeFiles/CMakeTmp/CMakeFiles 1
Building CXX object CMakeFiles/cmTryCompileExec38740299.dir/src.cxx.o
/bin/c++    -fexcess-precision=fast  -DCXX__Wattributes_VALID -fPIE   -fexcess-precision=fast -Wattributes -o CMakeFiles/cmTryCompileExec38740299.dir/src.cxx.o -c /tmp/build/CMakeFiles/CMakeTmp/src.cxx
Linking CXX executable cmTryCompileExec38740299
/usr/bin/cmake -E cmake_link_script CMakeFiles/cmTryCompileExec38740299.dir/link.txt --verbose=1
/bin/c++    -fexcess-precision=fast  -DCXX__Wattributes_VALID    CMakeFiles/cmTryCompileExec38740299.dir/src.cxx.o  -o cmTryCompileExec38740299 -rdynamic 
gmake[1]: Leaving directory `/tmp/build/CMakeFiles/CMakeTmp'

Source file was:
int main(void) { return 0; }
Performing C++ SOURCE FILE Test CXX__Wdiv_by_zero_VALID succeded with the following output:
Change Dir: /tmp/build/CMakeFiles/CMakeTmp

Run Build Command:/bin/gmake "cmTryCompileExec2523246079/fast"
/bin/gmake -f CMakeFiles/cmTryCompileExec2523246079.dir/build.make CMakeFiles/cmTryCompileExec2523246079.dir/build
gmake[1]: Entering directory `/tmp/build/CMakeFiles/CMakeTmp'
/usr/bin/cmake -E cmake_progress_report /tmp/build/CMakeFiles/CMakeTmp/CMakeFiles 1
Building CXX object CMakeFiles/cmTryCompileExec2523246079.dir/src.cxx.o
/bin/c++    -fexcess-precision=fast  -DCXX__Wdiv_by_zero_VALID -fPIE   -fexcess-precision=fast -Wdiv-by-zero -o CMakeFiles/cmTryCompileExec2523246079.dir/src.cxx.o -c /tmp/build/CMakeFiles/CMakeTmp/src.cxx
Linking CXX executable cmTryCompileExec2523246079
/usr/bin/cmake -E cmake_link_script CMakeFiles/cmTryCompileExec2523246079.dir/link.txt --verbose=1
/bin/c++    -fexcess-precision=fast  -DCXX__Wdiv_by_zero_VALID    CMakeFiles/cmTryCompileExec2523246079.dir/src.cxx.o  -o cmTryCompileExec2523246079 -rdynamic 
gmake[1]: Leaving directory `/tmp/build/CMakeFiles/CMakeTmp'

Source file was:
int main(void) { return 0; }
Performing C++ SOURCE FILE Test CXX__Wignored_qualifiers_VALID succeded with the following output:
Change Dir: /tmp/build/CMakeFiles/CMakeTmp

Run Build Command:/bin/gmake "cmTryCompileExec3829871177/fast"
/bin/gmake -f CMakeFiles/cmTryCompileExec3829871177.dir/build.make CMakeFiles/cmTryCompileExec3829871177.dir/build
gmake[1]: Entering directory `/tmp/build/CMakeFiles/CMakeTmp'
/usr/bin/cmake -E cmake_progress_report /tmp/build/CMakeFiles/CMakeTmp/CMakeFiles 1
Building CXX object CMakeFiles/cmTryCompileExec3829871177.dir/src.cxx.o
/bin/c++    -fexcess-precision=fast  -DCXX__Wignored_qualifiers_VALID -fPIE   -fexcess-precision=fast -Wignored-qualifiers -o CMakeFiles/cmTryCompileExec3829871177.dir/src.cxx.o -c /tmp/build/CMakeFiles/CMakeTmp/src.cxx
Linking CXX executable cmTryCompileExec3829871177
/usr/bin/cmake -E cmake_link_script CMakeFiles/cmTryCompileExec3829871177.dir/link.txt --verbose=1
/bin/c++    -fexcess-precision=fast  -DCXX__Wignored_qualifiers_VALID    CMakeFiles/cmTryCompileExec3829871177.dir/src.cxx.o  -o cmTryCompileExec3829871177 -rdynamic 
gmake[1]: Leaving directory `/tmp/build/CMakeFiles/CMakeTmp'

Source file was:
int main(void) { return 0; }
Performing C++ SOURCE FILE Test CXX__Wpragmas_VALID succeded with the following output:
Change Dir: /tmp/build/CMakeFiles/CMakeTmp

Run Build Command:/bin/gmake "cmTryCompileExec3039418387/fast"
/bin/gmake -f CMakeFiles/cmTryCompileExec3039418387.dir/build.make CMakeFiles/cmTryCompileExec3039418387.dir/build
gmake[1]: Entering directory `/tmp/build/CMakeFiles/CMakeTmp'
/usr/bin/cmake -E cmake_progress_report /tmp/build/CMakeFiles/CMakeTmp/CMakeFiles 1
Building CXX object CMakeFiles/cmTryCompileExec3039418387.dir/src.cxx.o
/bin/c++    -fexcess-precision=fast  -DCXX__Wpragmas_VALID -fPIE   -fexcess-precision=fast -Wpragmas -o CMakeFiles/cmTryCompileExec3039418387.dir/src.cxx.o -c /tmp/build/CMakeFiles/CMakeTmp/src.cxx
Linking CXX executable cmTryCompileExec3039418387
/usr/bin/cmake -E cmake_link_script CMakeFiles/cmTryCompileExec3039418387.dir/link.txt --verbose=1
/bin/c++    -fexcess-precision=fast  -DCXX__Wpragmas_VALID    CMakeFiles/cmTryCompileExec3039418387.dir/src.cxx.o  -o cmTryCompileExec3039418387 -rdynamic 
gmake[1]: Leaving directory `/tmp/build/CMakeFiles/CMakeTmp'

Source file was:
int main(void) { return 0; }
Performing C++ SOURCE FILE Test CXX__Wno_overlength_strings_VALID succeded with the following output:
Change Dir: /tmp/build/CMakeFiles/CMakeTmp

Run Build Command:/bin/gmake "cmTryCompileExec2963239432/fast"
/bin/gmake -f CMakeFiles/cmTryCompileExec2963239432.dir/build.make CMakeFiles/cmTryCompileExec2963239432.dir/build
gmake[1]: Entering directory `/tmp/build/CMakeFiles/CMakeTmp'
/usr/bin/cmake -E cmake_progress_report /tmp/build/CMakeFiles/CMakeTmp/CMakeFiles 1
Building CXX object CMakeFiles/cmTryCompileExec2963239432.dir/src.cxx.o
/bin/c++    -fexcess-precision=fast  -DCXX__Wno_overlength_strings_VALID -fPIE   -fexcess-precision=fast -Wno-overlength-strings -o CMakeFiles/cmTryCompileExec2963239432.dir/src.cxx.o -c /tmp/build/CMakeFiles/CMakeTmp/src.cxx
Linking CXX executable cmTryCompileExec2963239432
/usr/bin/cmake -E cmake_link_script CMakeFiles/cmTryCompileExec2963239432.dir/link.txt --verbose=1
/bin/c++    -fexcess-precision=fast  -DCXX__Wno_overlength_strings_VALID    CMakeFiles/cmTryCompileExec2963239432.dir/src.cxx.o  -o cmTryCompileExec2963239432 -rdynamic 
gmake[1]: Leaving directory `/tmp/build/CMakeFiles/CMakeTmp'

Source file was:
int main(void) { return 0; }
Performing C++ SOURCE FILE Test CXX__Wno_long_long_VALID succeded with the following output:
Change Dir: /tmp/build/CMakeFiles/CMakeTmp

Run Build Command:/bin/gmake "cmTryCompileExec3522952115/fast"
/bin/gmake -f CMakeFiles/cmTryCompileExec3522952115.dir/build.make CMakeFiles/cmTryCompileExec3522952115.dir/build
gmake[1]: Entering directory `/tmp/build/CMakeFiles/CMakeTmp'
/usr/bin/cmake -E cmake_progress_report /tmp/build/CMakeFiles/CMakeTmp/CMakeFiles 1
Building CXX object CMakeFiles/cmTryCompileExec3522952115.dir/src.cxx.o
/bin/c++    -fexcess-precision=fast  -DCXX__Wno_long_long_VALID -fPIE   -fexcess-precision=fast -Wno-long-long -o CMakeFiles/cmTryCompileExec3522952115.dir/src.cxx.o -c /tmp/build/CMakeFiles/CMakeTmp/src.cxx
Linking CXX executable cmTryCompileExec3522952115
/usr/bin/cmake -E cmake_link_script CMakeFiles/cmTryCompileExec3522952115.dir/link.txt --verbose=1
/bin/c++    -fexcess-precision=fast  -DCXX__Wno_long_long_VALID    CMakeFiles/cmTryCompileExec3522952115.dir/src.cxx.o  -o cmTryCompileExec3522952115 -rdynamic 
gmake[1]: Leaving directory `/tmp/build/CMakeFiles/CMakeTmp'

Source file was:
int main(void) { return 0; }
Performing C++ SOURCE FILE Test CXX__Wframe_larger_than_32768_VALID succeded with the following output:
Change Dir: /tmp/build/CMakeFiles/CMakeTmp

Run Build Command:/bin/gmake "cmTryCompileExec2145626459/fast"
/bin/gmake -f CMakeFiles/cmTryCompileExec2145626459.dir/build.make CMakeFiles/cmTryCompileExec2145626459.dir/build
gmake[1]: Entering directory `/tmp/build/CMakeFiles/CMakeTmp'
/usr/bin/cmake -E cmake_progress_report /tmp/build/CMakeFiles/CMakeTmp/CMakeFiles 1
Building CXX object CMakeFiles/cmTryCompileExec2145626459.dir/src.cxx.o
/bin/c++    -fexcess-precision=fast  -DCXX__Wframe_larger_than_32768_VALID -fPIE   -fexcess-precision=fast -Wframe-larger-than=32768 -o CMakeFiles/cmTryCompileExec2145626459.dir/src.cxx.o -c /tmp/build/CMakeFiles/CMakeTmp/src.cxx
Linking CXX executable cmTryCompileExec2145626459
/usr/bin/cmake -E cmake_link_script CMakeFiles/cmTryCompileExec2145626459.dir/link.txt --verbose=1
/bin/c++    -fexcess-precision=fast  -DCXX__Wframe_larger_than_32768_VALID    CMakeFiles/cmTryCompileExec2145626459.dir/src.cxx.o  -o cmTryCompileExec2145626459 -rdynamic 
gmake[1]: Leaving directory `/tmp/build/CMakeFiles/CMakeTmp'

Source file was:
int main(void) { return 0; }
Performing C SOURCE FILE Test FVHIDDEN succeded with the following output:
Change Dir: /tmp/build/CMakeFiles/CMakeTmp

Run Build Command:/bin/gmake "cmTryCompileExec2857009295/fast"
/bin/gmake -f CMakeFiles/cmTryCompileExec2857009295.dir/build.make CMakeFiles/cmTryCompileExec2857009295.dir/build
gmake[1]: Entering directory `/tmp/build/CMakeFiles/CMakeTmp'
/usr/bin/cmake -E cmake_progress_report /tmp/build/CMakeFiles/CMakeTmp/CMakeFiles 1
Building C object CMakeFiles/cmTryCompileExec2857009295.dir/src.c.o
/bin/cc   -Wall -Wextra -Wendif-labels -Wpointer-arith -Wformat-security -fwrapv -fno-strict-overflow -Wvla -Waddress -Wattributes -Wdiv-by-zero -Wignored-qualifiers -Wpragmas -Wno-overlength-strings -Wno-long-long -Wframe-larger-than=32768 -Wc++-compat -Wshadow -Wno-pointer-sign -Wold-style-definition -Wstrict-prototypes -Wlogical-op -Wjump-misses-init -Werror=implicit  -fexcess-precision=fast -std=gnu99  -DFVHIDDEN -fPIE   -fvisibility=hidden -o CMakeFiles/cmTryCompileExec2857009295.dir/src.c.o   -c /tmp/build/CMakeFiles/CMakeTmp/src.c
Linking C executable cmTryCompileExec2857009295
/usr/bin/cmake -E cmake_link_script CMakeFiles/cmTryCompileExec2857009295.dir/link.txt --verbose=1
/bin/cc   -Wall -Wextra -Wendif-labels -Wpointer-arith -Wformat-security -fwrapv -fno-strict-overflow -Wvla -Waddress -Wattributes -Wdiv-by-zero -Wignored-qualifiers -Wpragmas -Wno-overlength-strings -Wno-long-long -Wframe-larger-than=32768 -Wc++-compat -Wshadow -Wno-pointer-sign -Wold-style-definition -Wstrict-prototypes -Wlogical-op -Wjump-misses-init -Werror=implicit  -fexcess-precision=fast -std=gnu99  -DFVHIDDEN    CMakeFiles/cmTryCompileExec2857009295.dir/src.c.o  -o cmTryCompileExec2857009295 -rdynamic 
gmake[1]: Leaving directory `/tmp/build/CMakeFiles/CMakeTmp'

Source file was:
int main(void) { return 0; }
Performing C SOURCE FILE Test WS_LD_FLAG_VALID0 succeded with the following output:
Change Dir: /tmp/build/CMakeFiles/CMakeTmp

Run Build Command:/bin/gmake "cmTryCompileExec4026103016/fast"
/bin/gmake -f CMakeFiles/cmTryCompileExec4026103016.dir/build.make CMakeFiles/cmTryCompileExec4026103016.dir/build
gmake[1]: Entering directory `/tmp/build/CMakeFiles/CMakeTmp'
/usr/bin/cmake -E cmake_progress_report /tmp/build/CMakeFiles/CMakeTmp/CMakeFiles 1
Building C object CMakeFiles/cmTryCompileExec4026103016.dir/src.c.o
/bin/cc   -fvisibility=hidden  -Wall -Wextra -Wendif-labels -Wpointer-arith -Wformat-security -fwrapv -fno-strict-overflow -Wvla -Waddress -Wattributes -Wdiv-by-zero -Wignored-qualifiers -Wpragmas -Wno-overlength-strings -Wno-long-long -Wframe-larger-than=32768 -Wc++-compat -Wshadow -Wno-pointer-sign -Wold-style-definition -Wstrict-prototypes -Wlogical-op -Wjump-misses-init -Werror=implicit  -fexcess-precision=fast -std=gnu99  -DWS_LD_FLAG_VALID0 -fPIE   -o CMakeFiles/cmTryCompileExec4026103016.dir/src.c.o   -c /tmp/build/CMakeFiles/CMakeTmp/src.c
Linking C executable cmTryCompileExec4026103016
/usr/bin/cmake -E cmake_link_script CMakeFiles/cmTryCompileExec4026103016.dir/link.txt --verbose=1
/bin/cc  -fvisibility=hidden  -Wall -Wextra -Wendif-labels -Wpointer-arith -Wformat-security -fwrapv -fno-strict-overflow -Wvla -Waddress -Wattributes -Wdiv-by-zero -Wignored-qualifiers -Wpragmas -Wno-overlength-strings -Wno-long-long -Wframe-larger-than=32768 -Wc++-compat -Wshadow -Wno-pointer-sign -Wold-style-definition -Wstrict-prototypes -Wlogical-op -Wjump-misses-init -Werror=implicit  -fexcess-precision=fast -std=gnu99  -DWS_LD_FLAG_VALID0    CMakeFiles/cmTryCompileExec4026103016.dir/src.c.o  -o cmTryCompileExec4026103016 -rdynamic -Wl,--as-needed 
gmake[1]: Leaving directory `/tmp/build/CMakeFiles/CMakeTmp'

Source file was:
int main(void) { return 0;}
Performing C SOURCE FILE Test WS_LD_FLAG_VALID1 succeded with the following output:
Change Dir: /tmp/build/CMakeFiles/CMakeTmp

Run Build Command:/bin/gmake "cmTryCompileExec3546100641/fast"
/bin/gmake -f CMakeFiles/cmTryCompileExec3546100641.dir/build.make CMakeFiles/cmTryCompileExec3546100641.dir/build
gmake[1]: Entering directory `/tmp/build/CMakeFiles/CMakeTmp'
/usr/bin/cmake -E cmake_progress_report /tmp/build/CMakeFiles/CMakeTmp/CMakeFiles 1
Building C object CMakeFiles/cmTryCompileExec3546100641.dir/src.c.o
/bin/cc   -fvisibility=hidden  -Wall -Wextra -Wendif-labels -Wpointer-arith -Wformat-security -fwrapv -fno-strict-overflow -Wvla -Waddress -Wattributes -Wdiv-by-zero -Wignored-qualifiers -Wpragmas -Wno-overlength-strings -Wno-long-long -Wframe-larger-than=32768 -Wc++-compat -Wshadow -Wno-pointer-sign -Wold-style-definition -Wstrict-prototypes -Wlogical-op -Wjump-misses-init -Werror=implicit  -fexcess-precision=fast -std=gnu99  -DWS_LD_FLAG_VALID1 -fPIE   -o CMakeFiles/cmTryCompileExec3546100641.dir/src.c.o   -c /tmp/build/CMakeFiles/CMakeTmp/src.c
Linking C executable cmTryCompileExec3546100641
/usr/bin/cmake -E cmake_link_script CMakeFiles/cmTryCompileExec3546100641.dir/link.txt --verbose=1
/bin/cc  -fvisibility=hidden  -Wall -Wextra -Wendif-labels -Wpointer-arith -Wformat-security -fwrapv -fno-strict-overflow -Wvla -Waddress -Wattributes -Wdiv-by-zero -Wignored-qualifiers -Wpragmas -Wno-overlength-strings -Wno-long-long -Wframe-larger-than=32768 -Wc++-compat -Wshadow -Wno-pointer-sign -Wold-style-definition -Wstrict-prototypes -Wlogical-op -Wjump-misses-init -Werror=implicit  -fexcess-precision=fast -std=gnu99  -DWS_LD_FLAG_VALID1    CMakeFiles/cmTryCompileExec3546100641.dir/src.c.o  -o cmTryCompileExec3546100641 -rdynamic -pie 
gmake[1]: Leaving directory `/tmp/build/CMakeFiles/CMakeTmp'

Source file was:
int main(void) { return 0;}