Wireshark-dev: [Wireshark-dev] error generating the build files Wireshark
From: Jonathan Muñoz <[email protected]>
Date: Mon, 1 Feb 2016 18:22:50 +0100
Hello,

I get this warning in red letters when generating the build files:

'LC_ALL' is not recognized as an internal or external command, operable program or batch file

Then when I build Wireshark it fails with these errors:


Build FAILED.

       "C:\wsbuild64\Wireshark.sln" (default target) (1) ->
       "C:\wsbuild64\docbook\release_notes_html.vcxproj.metaproj" (default targ
       et) (58) ->
       "C:\wsbuild64\docbook\release_notes_html.vcxproj" (default target) (67)
       ->
       (CustomBuild target) ->
         C:\Program Files (x86)\MSBuild\Microsoft.Cpp\v4.0\V120\Microsoft.CppCo
       mmon.targets(170,5): error MSB6006: "cmd.exe" exited with code 9009. [C:
       \wsbuild64\docbook\release_notes_html.vcxproj]


       "C:\wsbuild64\Wireshark.sln" (default target) (1) ->
       "C:\wsbuild64\docbook\user_guide_docbook.vcxproj.metaproj" (default targ
       et) (63) ->
       "C:\wsbuild64\docbook\user_guide_docbook.vcxproj" (default target) (68)
       ->
         C:\Program Files (x86)\MSBuild\Microsoft.Cpp\v4.0\V120\Microsoft.CppCo
       mmon.targets(170,5): error MSB6006: "cmd.exe" exited with code 9009. [C:
       \wsbuild64\docbook\user_guide_docbook.vcxproj]


       "C:\wsbuild64\Wireshark.sln" (default target) (1) ->
       "C:\wsbuild64\docbook\developer_guide_docbook.vcxproj.metaproj" (default
        target) (53) ->
       "C:\wsbuild64\docbook\developer_guide_docbook.vcxproj" (default target)
       (86) ->
         C:\Program Files (x86)\MSBuild\Microsoft.Cpp\v4.0\V120\Microsoft.CppCo
       mmon.targets(170,5): error MSB6006: "cmd.exe" exited with code 9009. [C:
       \wsbuild64\docbook\developer_guide_docbook.vcxproj]

    0 Warning(s)
    3 Error(s)

Does someone have had the same problem?

Thanks!


--
Jonathan Muñoz