Wireshark-dev: [Wireshark-dev] r52963 introduced a build error
From: Toralf Förster <[email protected]>
Date: Tue, 29 Oct 2013 21:12:03 +0100
------------------------------------------------------------------------
r52963 | mmann | 2013-10-29 21:04:50 +0100 (Tue, 29 Oct 2013) | 1 line

Remove use of pinfo->private_data
------------------------------------------------------------------------




make  all-recursive
make[4]: Entering directory `/home/tfoerste/devel/wireshark/epan/dissectors'
make[5]: Entering directory `/home/tfoerste/devel/wireshark/epan/dissectors'
  CC     libdissectors_la-packet-isakmp.lo
  CC     libdissectors_la-packet-pdcp-lte.lo
  CC     libdissectors_la-register.lo
packet-isakmp.c: In function 'dissect_proposal':
packet-isakmp.c:3002:108: error: unused parameter 'pinfo' [-Werror=unused-parameter]
cc1: all warnings being treated as errors
make[5]: *** [libdissectors_la-packet-isakmp.lo] Error 1
make[5]: *** Waiting for unfinished jobs....
make[5]: Leaving directory `/home/tfoerste/devel/wireshark/epan/dissectors'
make[4]: *** [all-recursive] Error 1
make[4]: Leaving directory `/home/tfoerste/devel/wireshark/epan/dissectors'
make[3]: *** [all] Error 2

-- 
MfG/Sincerely
Toralf Förster
pgp finger print: 7B1A 07F4 EC82 0F90 D4C2 8936 872A E508 7DB6 9DA3