Wireshark-dev: Re: [Wireshark-dev] [Wireshark-commits] buildbot failure in Wireshark (developme
From: Joerg Mayer <[email protected]>
Date: Wed, 24 Apr 2013 22:12:51 +0200
On Wed, Apr 24, 2013 at 06:26:31AM -0700, [email protected] wrote:
> The Buildbot has detected a new failure on builder OSX-10.6-x64 while building Wireshark (development).
> Full details are available at:
>  http://buildbot.wireshark.org/trunk/builders/OSX-10.6-x64/builds/5594
> 
> Buildbot URL: http://buildbot.wireshark.org/trunk/
> 
> Buildslave for this Build: osx-10.6-x64
> 
> Build Reason: scheduler
> Build Source Stamp: 49013
> Blamelist: jmayer
> 
> BUILD FAILED: failed compile_1

Looks to me that the error is unrelated to whichever change got me onto
the blamelist:

mv -f .deps/libgtkui_a-hostlist_tr.Tpo .deps/libgtkui_a-hostlist_tr.Po
mv -f .deps/libgtkui_a-hostlist_tcpip.Tpo .deps/libgtkui_a-hostlist_tcpip.Po
sh: /usr/bin/mv: No such file or directory
mv -f .deps/libgtkui_a-hostlist_jxta.Tpo .deps/libgtkui_a-hostlist_jxta.Po
make[2]: *** [libgtkui_a-hostlist_tr.o] Error 127
make[2]: *** Waiting for unfinished jobs....
mv -f .deps/libgtkui_a-hostlist_udpip.Tpo .deps/libgtkui_a-hostlist_udpip.Po
mv -f .deps/libgtkui_a-hostlist_rsvp.Tpo .deps/libgtkui_a-hostlist_rsvp.Po
mv -f .deps/libgtkui_a-hostlist_usb.Tpo .deps/libgtkui_a-hostlist_usb.Po
mv -f .deps/libgtkui_a-hostlist_wlan.Tpo .deps/libgtkui_a-hostlist_wlan.Po
mv -f .deps/libgtkui_a-iax2_analysis.Tpo .deps/libgtkui_a-iax2_analysis.Po
make[1]: *** [all-recursive] Error 1
make: *** [all] Error 2
program finished with exit code 2

A missing /usr/bin/mv is not part of my commit rights ;-)

Ciao
       Jörg
-- 
Joerg Mayer                                           <[email protected]>
We are stuck with technology when what we really want is just stuff that
works. Some say that should read Microsoft instead of technology.