Wireshark-dev: [Wireshark-dev] problem in compiling
From: nima <[email protected]>
Date: Sat, 28 Jun 2008 00:21:59 +0330
Hi every body
I had compiled and installed the ethereal 9.x.x without any problem, but while installing Wireshark 1.0.0 the error below arises : /* gcc -DINET6 "-D_U_=__attribute__((unused))" -g -O2 -Wall -W -Wdeclaration-after-statement -Wendif-labels -Wpointer-arith -I/usr/local/include -pthread -I/usr/include/gtk-2.0 -I/usr/lib/gtk-2.0/include -I/usr/include/atk-1.0 -I/usr/include/cairo -I/usr/include/pango-1.0 -I/usr/include/glib-2.0 -I/usr/lib/glib-2.0/include -I/usr/include/freetype2 -I/usr/X11R6/include -I/usr/include/libpng12 -o .libs/capinfos capinfos.o -Wl,--export-dynamic -L/usr/local/lib wiretap/.libs/libwiretap.so /usr/lib/libgmodule-2.0.so -ldl /usr/lib/libglib-2.0.so -lz
capinfos.o(.text+0x1f3): In function `main':
/root/wireshark-1.0.0/capinfos.c:293: undefined reference to `get_credential_info'
collect2: ld returned 1 exit status
make[2]: *** [capinfos] Error 1
make[2]: Leaving directory `/root/wireshark-1.0.0'
make[1]: *** [all-recursive] Error 1
make[1]: Leaving directory `/root/wireshark-1.0.0'
make: *** [all] Error 2
*/please guide me for meet this problem
thanks for any help and guidance
Kind Regards
Nima chavoshi